program: Orca
programVersion: 5.0.2
elementType: Cl S F F F O O O O O O N N C C C C C C C C C C C C C C C H H H H H H H H H H
charge: 0
multiplicity: 1
keywords: wb97x-d3
keywords: def2-TZVPP
keywords: def2/J RIJCOSX
keywords: DEFGRID2
keywords: scfconv7
keywords: smallprint printgap noloewdin
keywords: NOSOSCF
formula: C15H10ClF3N2O6S
InChI: InChI=1/C15H10ClF3N2O6S/c1-28(25,26)20-14(22)10-7-9(3-4-12(10)21(23)24)27-13-5-2-8(6-11(13)16)15(17,18)19/h2-7,20H,1H3
38 atoms
Cl -1.019595 1.361715 -0.394097
S  3.297008 2.352844 0.26014
F  -6.539174 0.665916 -0.375263
F  -5.733231 -0.067483 -2.227321
F  -6.61419 -1.437978 -0.824359
O  -0.873529 -0.813436 1.649892
O  4.563222 -0.78243 2.104554
O  4.289731 3.387687 0.054534
O  2.746417 1.625961 -0.864278
O  4.754088 -0.792509 -0.875395
O  3.897967 -2.36662 -2.037392
N  4.04029 1.250369 1.298212
N  3.845671 -1.541412 -1.158014
C  2.615746 -0.676412 0.777575
C  0.259271 -1.069128 0.94986
C  2.62487 -1.423484 -0.396349
C  1.43069 -0.528652 1.466778
C  3.844234 -0.101724 1.415885
C  -2.060164 -0.726678 0.984908
C  0.273521 -1.829316 -0.210489
C  1.468028 -2.009151 -0.881122
C  -4.520588 -0.51767 -0.266204
C  -2.271583 0.250899 0.014279
C  -3.085971 -1.587846 1.329611
C  -3.49703 0.353175 -0.613914
C  -4.321704 -1.479668 0.71327
C  1.977367 3.023706 1.229963
C  -5.853248 -0.346541 -0.924478
H  1.395134 0.032788 2.392614
H  -0.630996 -2.271656 -0.606828
H  1.480549 -2.588286 -1.793395
H  4.84874 1.623081 1.791423
H  -2.915679 -2.339619 2.089133
H  -3.641377 1.119519 -1.364001
H  -5.110884 -2.159504 1.002869
H  1.273802 2.242999 1.505775
H  2.390476 3.488105 2.123121
H  1.473619 3.777238 0.623614
elementType: Cl S F O N C H
totalener: -2296.51144101 hartree
nucrepener: 3116.80665271 hartree
electener: -5413.31809372 hartree
oneelecener: -9358.51224764 hartree
twoeener: 3945.19415392 hartree
cpcmener: -0.04820358 hartree
kineticenergy: 2289.69196008 hartree
xcener: -167.492141230109 hartree
chargesum: 0.0000000
charge: -0.062204 0.844637 -0.179234 -0.180978 -0.178032 -0.300940 -0.395880 -0.505883 -0.482340 -0.376747 -0.384494 -0.163407 0.571367 -0.046132 0.185570 0.024975 -0.197558 0.338245 0.200184 -0.101420 -0.081328 -0.040175 0.084909 -0.175843 -0.150482 -0.126537 -0.236338 0.558173 0.162760 0.163785 0.161601 0.201566 0.155668 0.134303 0.155077 0.125556 0.150944 0.146632
qa: -0.0622 0.8446 -0.1792 -0.1810 -0.1780 -0.3009 -0.3959 -0.5059 -0.4823 -0.3767 -0.3845 -0.1634 0.5714 -0.0461 0.1856 0.0250 -0.1976 0.3382 0.2002 -0.1014 -0.0813 -0.0402 0.0849 -0.1758 -0.1505 -0.1265 -0.2363 0.5582 0.1628 0.1638 0.1616 0.2016 0.1557 0.1343 0.1551 0.1256 0.1509 0.1466
va: 1.2617 5.7672 1.1113 1.1206 1.1265 2.1092 2.1058 1.9877 1.9770 1.8742 1.8803 3.1025 4.0925 3.8656 3.8621 3.7877 4.0227 4.2587 3.7749 3.9162 4.0527 3.7015 3.9530 3.9934 4.1161 3.9662 3.8751 4.4169 1.0027 0.9932 1.0148 1.0116 1.0016 1.0269 1.0051 1.0114 1.0125 1.0061
dispcorr: -0.024031732 hartree
energy: -2296.535472739496
dipole: 19.65160 -23.12846 -3.47686 1.54731 -1.19726 0.35005 10.90075 -8.53577 2.36498
magnitude: 4.21951 au
magnitude: 10.72513 debye
