program: Gaussian 09
title: 000056621
version: EM64L-G09RevD.01
frameworkgroup: C1[X(C12H13N5S2)]
method: RPBEPBE
basis: SDD
operation: Freq
keyword: #p
keyword: freq=noraman
keyword: PBEPBE/SDD
title: #p freq=noraman PBEPBE/SDD
converged: YES YES NO NO
title: Mulliken charges:
elementType: S S N N N N N C C C C C C C C C C C C H H H H H H H H H H H H H
charge: 0.269129 0.267416 -0.124669 -0.458538 -0.127741 -0.203625 -0.002134 0.182345 0.294568 0.022702 -0.368151 -0.346730 -0.043073 -0.637231 -0.215546 -0.234663 -0.430242 -0.568443 -0.664081 0.398398 0.237670 0.245559 0.244074 0.305661 0.244145 0.222548 0.223516 0.285000 0.284866 0.232348 0.232410 0.232513
chargesum: 0.00000
title: Mulliken charges with hydrogens summed into heavy atoms:
elementType: S S N N N N N C C C C C C C C C C C C
charge: 0.269129 0.267416 -0.124669 -0.060140 -0.127741 -0.203625 -0.002134 0.182345 0.294568 0.022702 -0.130480 -0.101171 -0.043073 0.156649 0.007002 -0.011147 -0.430242 0.001423 0.033190
polarizability: 3.87737879e+02 -5.45256586e+00 2.10045326e+02 -2.47678501e-02 -3.31048930e-02 8.71493039e+01
1716.lowfreq: -2.0219 -0.0019 0.0005 0.0012 1.4476 3.4555 29.5547 36.3904 53.6166
frequency: 29.4288 36.3892 53.6074 57.0129 75.0040 99.7358 108.5939 118.0129 152.7080 189.2508 223.8895 225.8821 230.5674 258.2110 283.8075 303.4787 312.9221 338.1150 376.7755 419.1823 437.0164 508.5854 518.5948 532.1086 559.3720 574.2607 580.2109 608.8994 614.8054 623.7451 673.1555 681.5901 750.9813 751.9339 764.7995 780.6579 824.9434 851.9209 858.4543 881.4198 929.6517 932.6953 964.8282 973.1876 992.7710 1007.9791 1031.4907 1046.0684 1071.9557 1081.4838 1106.9664 1126.8302 1147.1176 1160.1973 1190.6860 1234.1646 1235.9947 1256.6413 1276.5303 1281.7755 1327.0901 1383.4603 1400.7125 1401.3431 1410.2025 1417.7925 1446.7964 1450.7588 1467.1763 1471.6422 1474.3751 1481.9357 1490.4982 1507.9851 1551.1460 1593.7897 1635.4186 2987.1850 2989.6807 3050.0017 3077.0327 3084.3447 3088.1492 3122.7161 3130.4082 3131.4384 3144.5950 3159.5517 3171.1654 3324.2721
redmass: 3.9701 5.2986 2.0853 4.5741 6.5728 5.2621 5.4896 5.1835 1.1072 6.6340 4.6741 5.2290 1.1203 5.4630 3.8978 11.4405 8.5566 3.8578 5.8900 7.6520 3.2881 8.4846 7.1570 12.7528 10.8676 8.3947 3.8230 5.2513 6.4600 6.8996 10.1310 8.2765 6.1373 1.3099 4.0035 1.1124 4.6873 1.2593 1.2516 6.3433 11.9712 1.3817 7.3763 1.2996 1.7806 2.1094 11.6113 1.2123 2.2779 2.3595 1.6601 1.2794 2.2919 1.1328 3.4335 2.5923 1.2260 2.9133 1.9516 1.3225 2.4334 6.0302 2.8889 1.2870 2.1947 2.6514 3.1740 1.0896 1.4453 1.0385 2.1952 1.0485 1.0435 3.8306 4.7361 7.0956 7.6078 1.0339 1.0358 1.0593 1.1034 1.0972 1.1016 1.1004 1.0853 1.1087 1.0901 1.0959 1.0994 1.0859
irintensity: 0.6514 0.5933 0.2260 0.0852 6.6363 2.3897 0.6928 10.6831 0.2184 4.3354 0.0059 0.9347 0.0319 3.6677 2.3123 0.1988 0.0036 3.8004 0.1686 15.2332 11.1616 5.4239 0.7946 0.0226 0.1601 4.8207 0.2319 20.3092 1.0079 1.0944 59.4861 0.0542 45.2644 95.2014 0.4273 10.0414 6.8916 59.1416 53.9714 3.0734 42.0521 6.2893 17.8475 0.0003 29.6226 12.8686 46.3837 0.3603 19.1731 88.0843 6.0945 0.3423 9.4235 0.1400 1.0075 27.9192 0.5432 8.6922 76.6788 22.1323 16.6587 188.0395 21.4164 21.9367 11.3016 52.9792 50.2565 22.8206 27.3182 16.5046 3.6412 9.0740 19.7855 106.0646 1124.3443 6.3600 60.1315 35.9862 30.7994 3.3649 17.9592 19.0218 13.8180 2.7955 1.8019 19.3388 11.2435 23.2319 30.4921 376.7279
temp: 298.150 k
press: 1.00000 atm
elementType: 16 16 7 7 7 7 7 6 6 6 6 6 6 6 6 6 6 6 6 1 1 1 1 1 1 1 1 1 1 1 1 1
symmnumber: 1
zpe: 626195.5 jmol-1
zpe.correction: 0.238505 hartree
zpe.thermalcorrener: 0.256570 hartree
zpe.thermalcorrenthalpy: 0.257514 hartree
zpe.thermalcorrgfe: 0.190499 hartree
zpe.sumelectzpe: -1533.569834 hartree
zpe.sumelectthermal: -1533.551769 hartree
zpe.sumelectthermalent: -1533.550825 hartree
zpe.sumelectthermalfe: -1533.617840 hartree
dipole: -3.4131 -0.5024 0.0017
dipole: 3.4499
quadrupole: -115.7970 -113.4223 -130.7205
quadrupole: 4.2732 -0.0088 -0.0018
quadrupole: 4.1829 6.5576 -10.7405 4.2732 -0.0088 -0.0018
hfenergy: -1533.8083394 hartree
pointgroup: C01 [X(C12H13N5S2)]
dipole: 1.3445425 0.185558 -0.0032802 debye
polarizability: 387.6199908|-7.0430149|210.1470925|-1.2962273|1.1682779|87.1654258 unknown
InChI: InChI=1S/C12H13N5S2/c1-3-18-12-16-15-11(19-12)17(2)10-13-8-6-4-5-7-9(8)14-10/h4-7,13H,3H2,1-2H3
charge 0 multiplicity 1
32 atoms
S  2.737672 -2.017997 -0.068264
S  5.357366 -0.271725 -0.064219
N  -0.050428 -1.643416 -0.052695
N  -1.262572 0.49204 -0.027495
N  -2.472847 -1.459902 -0.041826
N  1.380376 0.302295 -0.040647
N  2.735024 0.670605 -0.043253
C  -1.24944 -0.898604 -0.041086
C  -2.611486 0.878595 -0.019062
C  -3.355627 -0.355124 -0.028063
C  -3.239549 2.139103 -0.005142
C  -4.768218 -0.326778 -0.022771
C  1.185123 -1.03016 -0.052149
C  -0.156411 -3.121119 -0.065529
C  -4.652263 2.145374 -0.000084
C  -5.402937 0.933524 -0.00874
C  3.565418 -0.363642 -0.056599
C  5.555942 1.63021 -0.045306
C  7.053072 1.956694 -0.052443
H  -0.380841 1.033173 -0.026436
H  -2.668199 3.07278 0.001713
H  -5.341237 -1.258812 -0.029434
H  0.318937 -3.532879 -0.973668
H  -1.228309 -3.367954 -0.064408
H  0.324473 -3.549037 0.832164
H  -5.18359 3.103435 0.010762
H  -6.497254 0.985358 -0.004346
H  5.029182 2.012497 -0.933089
H  5.041793 1.993406 0.857777
H  7.565909 1.546723 0.835368
H  7.55275 1.567139 -0.956788
H  7.183571 3.054299 -0.040841
