program: Orca
programVersion: 5.0.2
elementType: Cl S F F F O O O O O O N N C C C C C C C C C C C C C C C H H H H H H H H H H
charge: 0
multiplicity: 1
keywords: wb97x-d3
keywords: def2-TZVPP
keywords: def2/J RIJCOSX
keywords: DEFGRID2
keywords: scfconv7
keywords: smallprint printgap noloewdin
keywords: NOSOSCF
formula: C15H10ClF3N2O6S
InChI: InChI=1/C15H10ClF3N2O6S/c1-28(25,26)20-14(22)10-7-9(3-4-12(10)21(23)24)27-13-5-2-8(6-11(13)16)15(17,18)19/h2-7,20H,1H3
38 atoms
Cl -1.477577 1.750758 -0.304633
S  3.801671 2.19433 0.08165
F  -6.999269 -0.846984 0.136321
F  -6.348584 0.398298 -1.49736
F  -6.121772 -1.738746 -1.608879
O  -0.964427 -0.431067 1.631411
O  4.261023 -0.72732 2.564603
O  4.85858 3.175431 0.03878
O  3.431763 1.403178 -1.066637
O  4.842382 -1.195958 -0.392737
O  3.792466 -2.146364 -1.998182
N  4.236388 1.16897 1.350606
N  3.834108 -1.558437 -0.948289
C  2.567148 -0.575838 0.920684
C  0.167172 -0.732144 0.947396
C  2.574429 -1.272333 -0.281296
C  1.357388 -0.328005 1.54108
C  3.791535 -0.104506 1.654458
C  -2.17146 -0.499418 1.007885
C  0.180759 -1.416866 -0.258814
C  1.39339 -1.689164 -0.86566
C  -4.687511 -0.596418 -0.15495
C  -2.556827 0.472644 0.091861
C  -3.048865 -1.520119 1.336906
C  -3.813573 0.425244 -0.490136
C  -4.305169 -1.567916 0.762613
C  2.331159 2.99282 0.69313
C  -6.04648 -0.68837 -0.7863
H  1.323917 0.190169 2.491479
H  -0.735744 -1.743624 -0.731002
H  1.415406 -2.223274 -1.803982
H  5.061063 1.471042 1.857564
H  -2.741091 -2.266841 2.056518
H  -4.093374 1.194047 -1.196155
H  -4.980605 -2.367526 1.034879
H  2.040601 3.73405 -0.049877
H  1.531392 2.266437 0.814001
H  2.551549 3.486633 1.636109
totalener: -2296.48504702 hartree
nucrepener: 3082.02558202 hartree
electener: -5378.51062903 hartree
oneelecener: -9288.85661743 hartree
twoeener: 3910.34598839 hartree
kineticenergy: 2289.72915303 hartree
xcener: -167.489438490119 hartree
chargesum: -0.0000000
charge: -0.043918 0.833135 -0.168035 -0.168973 -0.165011 -0.283102 -0.298832 -0.445726 -0.438093 -0.330310 -0.335960 -0.190870 0.552292 -0.038311 0.187605 -0.023568 -0.207207 0.292156 0.165126 -0.078519 -0.089085 -0.055812 0.064341 -0.134794 -0.139167 -0.134611 -0.266210 0.551387 0.137897 0.134948 0.155176 0.176029 0.139618 0.135566 0.132815 0.135884 0.112910 0.129227
qa: -0.0439 0.8331 -0.1680 -0.1690 -0.1650 -0.2831 -0.2988 -0.4457 -0.4381 -0.3303 -0.3360 -0.1909 0.5523 -0.0383 0.1876 -0.0236 -0.2072 0.2922 0.1651 -0.0785 -0.0891 -0.0558 0.0643 -0.1348 -0.1392 -0.1346 -0.2662 0.5514 0.1379 0.1349 0.1552 0.1760 0.1396 0.1356 0.1328 0.1359 0.1129 0.1292
va: 1.2738 5.7916 1.1365 1.1398 1.1351 2.1296 2.2046 2.0561 2.0257 1.9185 1.9295 3.0810 4.1347 3.8885 3.8822 3.9409 3.9993 4.3034 3.8508 3.8939 4.1334 3.7931 3.9949 3.9887 4.0526 4.0509 3.9069 4.4282 1.0187 1.0070 1.0236 1.0312 1.0074 1.0264 1.0149 1.0135 1.0086 1.0161
dispcorr: -0.023499316 hartree
energy: -2296.508546331750
dipole: 21.66284 -24.19585 -2.53301 3.05968 -2.56632 0.49336 8.50142 -7.38304 1.11838
magnitude: 2.81253 au
magnitude: 7.14888 debye
