program: Orca
programVersion: 5.0.2
elementType: Cl S F F F O O O O O O N N C C C C C C C C C C C C C C C H H H H H H H H H H
charge: 0
multiplicity: 1
keywords: wb97x-d3
keywords: def2-TZVPP
keywords: def2/J RIJCOSX
keywords: DEFGRID2
keywords: scfconv7
keywords: smallprint printgap noloewdin
keywords: NOSOSCF
formula: C15H10ClF3N2O6S
InChI: InChI=1/C15H10ClF3N2O6S/c1-28(25,26)20-14(22)10-7-9(3-4-12(10)21(23)24)27-13-5-2-8(6-11(13)16)15(17,18)19/h2-7,20H,1H3
38 atoms
Cl -1.383998 0.262344 -2.543074
S  2.773683 2.298773 -0.042045
F  -4.907113 1.848246 1.277882
F  -6.163419 0.887709 -0.177479
F  -5.953288 0.036056 1.790514
O  -0.838912 -2.220574 -1.070649
O  1.83815 0.080345 2.978907
O  3.277895 3.613705 0.272583
O  3.556791 1.321377 -0.757782
O  4.499159 -0.373471 1.551209
O  5.223237 -1.806136 0.135042
N  2.309523 1.667087 1.454804
N  4.343883 -1.176987 0.664049
C  1.940762 -0.66246 0.743564
C  0.401928 -1.904019 -0.625649
C  2.980627 -1.410508 0.216337
C  0.643522 -0.92162 0.326213
C  2.078985 0.359867 1.837807
C  -1.910582 -1.526254 -0.601188
C  1.453546 -2.637363 -1.161051
C  2.740816 -2.390116 -0.734732
C  -4.120108 -0.136685 0.32487
C  -2.292656 -0.334821 -1.211668
C  -2.638359 -2.016401 0.4672
C  -3.396957 0.357549 -0.753938
C  -3.746108 -1.325063 0.930898
C  1.222228 2.478291 -0.894964
C  -5.296158 0.656984 0.811585
H  -0.172193 -0.362887 0.767242
H  1.254977 -3.399161 -1.90229
H  3.562879 -2.958908 -1.143183
H  2.403954 2.326496 2.219444
H  -2.335096 -2.944703 0.932259
H  -3.682279 1.279256 -1.243391
H  -4.30323 -1.7214 1.767089
H  0.559564 3.117839 -0.3180
H  1.438283 2.943439 -1.855641
H  0.771914 1.503124 -1.060221
totalener: -2296.48527622 hartree
nucrepener: 3142.15469758 hartree
electener: -5438.63997380 hartree
oneelecener: -9408.97672089 hartree
twoeener: 3970.33674709 hartree
kineticenergy: 2289.73855284 hartree
xcener: -167.490883396118 hartree
chargesum: 0.0000000
charge: -0.042590 0.831917 -0.166686 -0.166771 -0.167646 -0.282627 -0.301097 -0.445982 -0.438657 -0.331796 -0.335762 -0.190241 0.552054 -0.107531 0.264280 -0.017712 -0.142029 0.287699 0.174352 -0.179514 -0.054216 -0.053573 0.026967 -0.101708 -0.157804 -0.121103 -0.238871 0.552321 0.130994 0.134412 0.154008 0.175745 0.140243 0.122394 0.147167 0.125868 0.136356 0.087139
qa: -0.0426 0.8319 -0.1667 -0.1668 -0.1676 -0.2826 -0.3011 -0.4460 -0.4387 -0.3318 -0.3358 -0.1902 0.5521 -0.1075 0.2643 -0.0177 -0.1420 0.2877 0.1744 -0.1795 -0.0542 -0.0536 0.0270 -0.1017 -0.1578 -0.1211 -0.2389 0.5523 0.1310 0.1344 0.1540 0.1757 0.1402 0.1224 0.1472 0.1259 0.1364 0.0871
va: 1.2716 5.7939 1.1353 1.1380 1.1421 2.1529 2.2044 2.0557 2.0269 1.9154 1.9285 3.0851 4.1320 3.9862 3.7805 3.9360 3.8634 4.3079 3.8709 4.0812 4.0735 3.8031 3.9773 3.9852 4.1366 3.9788 3.8991 4.4330 1.0194 1.0132 1.0212 1.0316 1.0070 1.0337 1.0101 1.0148 1.0156 1.0285
dispcorr: -0.024039333 hartree
energy: -2296.509315556671
dipole: 17.73322 -20.24173 -2.50851 -3.36188 2.63830 -0.72358 -1.38007 0.33786 -1.04221
magnitude: 2.81112 au
magnitude: 7.14529 debye
