program: Orca
programVersion: 5.0.2
elementType: Cl S F F F O O O O O O N N C C C C C C C C C C C C C C C H H H H H H H H H H
charge: 0
multiplicity: 1
keywords: wb97x-d3
keywords: def2-TZVPP
keywords: def2/J RIJCOSX
keywords: DEFGRID2
keywords: scfconv7
keywords: smallprint printgap noloewdin
keywords: NOSOSCF
formula: C15H10ClF3N2O6S
InChI: InChI=1/C15H10ClF3N2O6S/c1-28(25,26)20-14(22)10-7-9(3-4-12(10)21(23)24)27-13-5-2-8(6-11(13)16)15(17,18)19/h2-7,20H,1H3
38 atoms
Cl -2.87494 -1.953423 2.664715
S  3.69085 2.622091 -0.280884
F  -6.794625 -0.608038 -0.509887
F  -6.035677 0.855183 -1.894901
F  -5.76711 -1.24052 -2.290179
O  -0.838804 -0.345334 1.383008
O  4.452768 -0.212475 2.217722
O  2.617849 1.931028 -0.957679
O  3.53774 3.962418 0.230288
O  4.94005 -0.641821 -0.771714
O  4.09101 -2.249693 -1.898161
N  4.146381 1.680866 1.042004
N  4.022164 -1.374024 -1.076506
C  2.689162 -0.268659 0.659145
C  0.32082 -0.638284 0.750443
C  2.758449 -1.154283 -0.40694
C  1.462007 -0.023621 1.243348
C  3.876095 0.35626 1.333355
C  -2.00764 -0.346323 0.692107
C  0.397334 -1.532464 -0.311832
C  1.624417 -1.788254 -0.888144
C  -4.464433 -0.300922 -0.589603
C  -3.080623 -1.054399 1.217904
C  -2.166063 0.384234 -0.477412
C  -4.310523 -1.026171 0.581136
C  -3.389579 0.403238 -1.119149
C  5.137673 2.59849 -1.318371
C  -5.774064 -0.320331 -1.319174
H  1.375558 0.660761 2.077104
H  -0.486856 -2.027248 -0.68992
H  1.697752 -2.477143 -1.71677
H  4.827233 2.11264 1.656961
H  -1.331743 0.947471 -0.876359
H  -5.133836 -1.579853 1.009874
H  -3.49879 0.981866 -2.02591
H  4.915813 3.219893 -2.184702
H  5.97953 3.022998 -0.776374
H  5.35721 1.582293 -1.629846
totalener: -2296.48725331 hartree
nucrepener: 3020.92589511 hartree
electener: -5317.41314843 hartree
oneelecener: -9167.28685842 hartree
twoeener: 3849.87371000 hartree
kineticenergy: 2289.75000368 hartree
xcener: -167.493057608914 hartree
chargesum: -0.0000000
charge: -0.031833 0.808442 -0.170172 -0.170208 -0.166189 -0.283748 -0.295704 -0.444683 -0.442280 -0.377252 -0.327611 -0.187832 0.550039 -0.052371 0.201454 0.022535 -0.122574 0.282072 0.164353 -0.106426 -0.088065 -0.052862 -0.001642 -0.123031 -0.121806 -0.133130 -0.262454 0.545435 0.123331 0.141519 0.153571 0.160273 0.152078 0.126278 0.136090 0.130496 0.118900 0.145008
qa: -0.0318 0.8084 -0.1702 -0.1702 -0.1662 -0.2837 -0.2957 -0.4447 -0.4423 -0.3773 -0.3276 -0.1878 0.5500 -0.0524 0.2015 0.0225 -0.1226 0.2821 0.1644 -0.1064 -0.0881 -0.0529 -0.0016 -0.1230 -0.1218 -0.1331 -0.2625 0.5454 0.1233 0.1415 0.1536 0.1603 0.1521 0.1263 0.1361 0.1305 0.1189 0.1450
va: 1.2850 5.8097 1.1365 1.1348 1.1282 2.1368 2.2037 2.0119 2.0493 1.8614 1.9318 3.0865 4.0985 3.9552 3.9205 3.8905 4.1004 4.2745 3.8818 3.9333 4.0814 3.7775 4.0227 3.9538 4.0398 4.0417 3.8915 4.4320 1.0207 1.0029 1.0215 1.0381 1.0001 1.0314 1.0143 1.0118 1.0130 1.0169
dispcorr: -0.021918552 hartree
energy: -2296.509171866121
dipole: 34.05261 -33.91862 0.13399 9.68021 -9.19706 0.48314 -3.98486 3.48089 -0.50397
magnitude: 0.71089 au
magnitude: 1.80694 debye
