program: Orca
programVersion: 5.0.2
elementType: Cl S F F F O O O O O O N N C C C C C C C C C C C C C C C H H H H H H H H H H
charge: 0
multiplicity: 1
keywords: wb97x-d3
keywords: def2-TZVPP
keywords: def2/J RIJCOSX
keywords: DEFGRID2
keywords: scfconv7
keywords: smallprint printgap noloewdin
keywords: NOSOSCF
formula: C15H10ClF3N2O6S
InChI: InChI=1/C15H10ClF3N2O6S/c1-28(25,26)20-14(22)10-7-9(3-4-12(10)21(23)24)27-13-5-2-8(6-11(13)16)15(17,18)19/h2-7,20H,1H3
38 atoms
Cl -1.91463 -1.599332 2.125946
S  4.379976 2.515085 -0.318786
F  -6.677177 -0.659404 -1.852712
F  -6.317663 -2.408359 -0.646224
F  -7.115204 -0.623962 0.25149
O  -1.125819 0.84863 0.670496
O  3.751697 0.003764 2.530295
O  3.359101 1.981465 -1.189456
O  4.460175 3.919724 0.000698
O  4.727474 -0.909714 -0.234077
O  3.767862 -2.254373 -1.591214
N  4.243972 1.712002 1.155716
N  3.743446 -1.378864 -0.766857
C  2.403909 0.144779 0.610638
C  0.024602 0.243961 0.292528
C  2.463764 -0.834563 -0.373557
C  1.174144 0.674549 0.944137
C  3.556086 0.557552 1.484199
C  -2.329585 0.335097 0.299196
C  0.092093 -0.731842 -0.693479
C  1.32109 -1.26684 -1.02388
C  -4.855405 -0.59565 -0.365125
C  -2.843674 -0.796705 0.926942
C  -3.076947 0.986206 -0.666242
C  -4.104687 -1.259577 0.596071
C  -4.341252 0.527394 -0.996277
C  5.980514 2.011538 -0.917424
C  -6.246814 -1.07448 -0.659814
H  1.09122 1.427838 1.716543
H  -0.794486 -1.072465 -1.210477
H  1.388955 -2.019495 -1.795395
H  4.867729 2.043666 1.883053
H  -2.66682 1.864606 -1.14626
H  -4.488004 -2.137412 1.098185
H  -4.912766 1.051619 -1.748692
H  6.008824 0.935823 -1.057432
H  6.134764 2.520176 -1.868109
H  6.746475 2.32783 -0.213031
totalener: -2296.48759406 hartree
nucrepener: 3023.95097181 hartree
electener: -5320.43856588 hartree
oneelecener: -9173.54511439 hartree
twoeener: 3853.10654851 hartree
kineticenergy: 2289.72881716 hartree
xcener: -167.490357236424 hartree
chargesum: -0.0000000
charge: -0.025494 0.808725 -0.170235 -0.170152 -0.163655 -0.277439 -0.300449 -0.442875 -0.443904 -0.386695 -0.330909 -0.185127 0.561446 -0.028765 0.184826 -0.013324 -0.111876 0.292610 0.158838 -0.097653 -0.086923 -0.044207 0.033370 -0.129197 -0.144210 -0.124573 -0.265088 0.544372 0.117841 0.133345 0.152124 0.157035 0.139866 0.124195 0.140222 0.145852 0.130182 0.117901
qa: -0.0255 0.8087 -0.1702 -0.1702 -0.1637 -0.2774 -0.3004 -0.4429 -0.4439 -0.3867 -0.3309 -0.1851 0.5614 -0.0288 0.1848 -0.0133 -0.1119 0.2926 0.1588 -0.0977 -0.0869 -0.0442 0.0334 -0.1292 -0.1442 -0.1246 -0.2651 0.5444 0.1178 0.1333 0.1521 0.1570 0.1399 0.1242 0.1402 0.1459 0.1302 0.1179
va: 1.2903 5.8168 1.1363 1.1351 1.1331 2.1450 2.2010 2.0152 2.0487 1.8532 1.9310 3.0887 4.0928 3.9560 3.9147 3.9225 4.1205 4.2629 3.8633 3.9199 4.1132 3.7759 4.0262 3.9924 4.0982 4.0009 3.8908 4.4326 1.0243 1.0080 1.0230 1.0396 1.0080 1.0322 1.0127 1.0176 1.0118 1.0128
dispcorr: -0.022102047 hartree
energy: -2296.509696108098
dipole: 34.07776 -34.22336 -0.14560 11.94155 -11.43698 0.50457 -5.07320 4.55966 -0.51354
magnitude: 0.73451 au
magnitude: 1.86699 debye
