program: Orca
programVersion: 5.0.2
elementType: Cl S S F O O O N N N C C C C C C C C C C C C C C C H H H H H H H H H H H H H H H
charge: 0
multiplicity: 1
keywords: wb97x-d3
keywords: def2-TZVPP
keywords: def2/J RIJCOSX
keywords: DEFGRID2
keywords: scfconv7
keywords: smallprint printgap noloewdin
keywords: NOSOSCF
formula: C15H15ClFN3O3S2
InChI: InChI=1/C15H15ClFN3O3S2/c1-23-13(21)8-24-12-7-11(10(17)6-9(12)16)18-14-19-4-2-3-5-20(19)15(22)25-14/h6-7H,2-5,8H2,1H3
40 atoms
Cl -4.220698 -0.266397 0.985645
S  1.911763 -2.30074 0.046665
S  -3.278951 0.717075 -1.931806
F  0.603262 -0.461075 2.298858
O  4.016224 -3.907377 0.084092
O  -5.20472 2.938608 -0.454676
O  -3.202846 3.194343 0.506848
N  3.683118 -0.474437 -0.332284
N  4.383157 -1.656112 -0.095381
N  1.540588 0.387835 -0.161929
C  5.776977 0.783338 -0.439366
C  6.524672 -0.491393 -0.083614
C  4.364374 0.745475 0.108198
C  5.759776 -1.701946 -0.580423
C  2.339414 -0.602205 -0.153594
C  3.628885 -2.763078 0.020855
C  0.189731 0.186559 0.082537
C  -0.765329 0.46288 -0.889158
C  -0.283361 -0.221266 1.328991
C  -2.128157 0.337728 -0.643385
C  -1.622368 -0.376296 1.607004
C  -2.546437 -0.092938 0.613926
C  -3.314616 2.535291 -1.789487
C  -3.882328 2.937891 -0.458781
C  -5.855684 3.24242 0.781635
H  6.278618 1.656481 -0.022273
H  5.748998 0.912441 -1.523924
H  7.514584 -0.500961 -0.539308
H  6.662677 -0.560335 0.997931
H  4.36589 0.78685 1.20117
H  3.784142 1.584711 -0.262751
H  5.753893 -1.737932 -1.672534
H  6.201478 -2.622924 -0.210449
H  -0.431151 0.793161 -1.863786
H  -1.934909 -0.700914 2.590329
H  -2.309215 2.934869 -1.907649
H  -3.932605 2.886698 -2.616424
H  -5.613084 4.250026 1.120687
H  -5.59229 2.524755 1.558468
H  -6.921391 3.180109 0.580849
elementType: Cl S F O N C H
totalener: -2327.13620337 hartree
nucrepener: 2708.41142326 hartree
electener: -5035.54762663 hartree
oneelecener: -8587.52849062 hartree
twoeener: 3551.98086399 hartree
cpcmener: -0.04130268 hartree
kineticenergy: 2320.86116191 hartree
xcener: -159.145795856337 hartree
chargesum: -0.0000000
charge: -0.069938 0.010071 -0.104522 -0.205906 -0.485114 -0.274568 -0.468411 -0.050905 -0.025322 -0.369408 -0.115453 -0.111739 -0.056348 -0.062634 0.224653 0.287261 0.024172 -0.130519 0.228994 0.009204 -0.132472 0.053276 -0.116242 0.391098 -0.111140 0.084058 0.078778 0.084159 0.079970 0.115665 0.103775 0.121654 0.101275 0.122013 0.138702 0.129009 0.146081 0.121615 0.104064 0.131092
qa: -0.0699 0.0101 -0.1045 -0.2059 -0.4851 -0.2746 -0.4684 -0.0509 -0.0253 -0.3694 -0.1155 -0.1117 -0.0563 -0.0626 0.2247 0.2873 0.0242 -0.1305 0.2290 0.0092 -0.1325 0.0533 -0.1162 0.3911 -0.1111 0.0841 0.0788 0.0842 0.0800 0.1157 0.1038 0.1217 0.1013 0.1220 0.1387 0.1290 0.1461 0.1216 0.1041 0.1311
va: 1.2518 2.5187 2.2057 1.0850 2.0273 2.1166 2.0106 3.1016 3.1160 2.9673 3.9171 3.9127 3.8930 3.9009 4.1888 4.3431 3.9032 4.0607 4.0264 3.8231 3.9948 3.8490 3.8858 4.1455 3.8447 1.0147 1.0158 1.0158 1.0155 1.0044 1.0179 1.0007 1.0193 1.0279 1.0115 1.0172 1.0140 0.9939 1.0015 0.9939
dispcorr: -0.021077549 hartree
energy: -2327.157280920876
dipole: 23.48889 -21.74842 1.74047 14.77589 -12.80222 1.97368 -5.91474 5.13652 -0.77822
magnitude: 2.74413 au
magnitude: 6.97503 debye
