program: Orca
programVersion: 5.0.2
elementType: Cl S S F O O O N N N C C C C C C C C C C C C C C C H H H H H H H H H H H H H H H
charge: 0
multiplicity: 1
keywords: wb97x-d3
keywords: def2-TZVPP
keywords: def2/J RIJCOSX
keywords: DEFGRID2
keywords: scfconv7
keywords: smallprint printgap noloewdin
keywords: NOSOSCF
formula: C15H15ClFN3O3S2
InChI: InChI=1/C15H15ClFN3O3S2/c1-23-13(21)8-24-12-7-11(10(17)6-9(12)16)18-14-19-4-2-3-5-20(19)15(22)25-14/h6-7H,2-5,8H2,1H3
40 atoms
Cl -4.672963 -0.495775 0.275276
S  1.740779 0.86666 0.04436
S  -2.905953 1.087354 -1.894152
F  -0.57273 -3.09673 1.478266
O  4.013245 2.202487 0.260198
O  -2.340118 2.01926 1.245361
O  -3.996021 3.326953 0.509602
N  3.301899 -1.169725 -0.213457
N  4.115716 -0.075565 0.074388
N  1.071859 -1.77494 -0.19294
C  5.228391 -2.673082 -0.007314
C  6.087438 -1.472284 0.355719
C  3.776962 -2.436083 0.360063
C  5.524297 -0.216331 -0.278969
C  1.969739 -0.875219 -0.156568
C  3.497665 1.11281 0.153415
C  -0.269841 -1.441914 -0.152953
C  -0.874271 -0.490808 -0.97043
C  -1.106512 -2.139022 0.719591
C  -2.226009 -0.175462 -0.861792
C  -2.449126 -1.869654 0.84334
C  -3.00458 -0.869276 0.058845
C  -2.306378 2.575778 -1.023715
C  -2.98007 2.704127 0.3135
C  -2.917318 1.969656 2.552353
H  5.308355 -2.882781 -1.076537
H  5.567173 -3.563587 0.523199
H  6.129298 -1.348454 1.440405
H  7.11005 -1.608827 0.003491
H  3.145735 -3.224249 -0.037777
H  3.647708 -2.408251 1.446186
H  6.038645 0.671643 0.078099
H  5.616538 -0.252974 -1.367354
H  -0.288039 0.010316 -1.730957
H  -3.04702 -2.422214 1.556035
H  -1.220916 2.544919 -0.937444
H  -2.583956 3.417539 -1.657318
H  -3.922465 1.549673 2.530438
H  -2.945712 2.958235 3.010047
H  -2.271076 1.321957 3.13726
elementType: Cl S F O N C H
totalener: -2327.13519324 hartree
nucrepener: 2774.25833125 hartree
electener: -5101.39352448 hartree
oneelecener: -8717.90049233 hartree
twoeener: 3616.50696785 hartree
cpcmener: -0.04235536 hartree
kineticenergy: 2320.85337878 hartree
xcener: -159.146253601307 hartree
chargesum: 0.0000000
charge: -0.070435 -0.007344 -0.104336 -0.204954 -0.488654 -0.274018 -0.472611 -0.062081 -0.020076 -0.390022 -0.115849 -0.110890 -0.056213 -0.064437 0.233018 0.289039 0.144764 -0.215768 0.194465 0.048529 -0.144726 0.025203 -0.109543 0.395046 -0.122268 0.078519 0.084151 0.079976 0.083662 0.102120 0.116448 0.101812 0.121480 0.156372 0.137077 0.128694 0.143061 0.109445 0.132062 0.129285
qa: -0.0704 -0.0073 -0.1043 -0.2050 -0.4887 -0.2740 -0.4726 -0.0621 -0.0201 -0.3900 -0.1158 -0.1109 -0.0562 -0.0644 0.2330 0.2890 0.1448 -0.2158 0.1945 0.0485 -0.1447 0.0252 -0.1095 0.3950 -0.1223 0.0785 0.0842 0.0800 0.0837 0.1021 0.1164 0.1018 0.1215 0.1564 0.1371 0.1287 0.1431 0.1094 0.1321 0.1293
va: 1.2513 2.5172 2.2137 1.0909 2.0245 2.1041 2.0214 3.1028 3.1169 2.9713 3.9181 3.9096 3.8961 3.9000 4.1784 4.3539 3.7844 4.0036 4.1543 3.7933 3.9654 3.8636 3.8887 4.1401 3.8367 1.0155 1.0145 1.0158 1.0160 1.0214 1.0043 1.0209 1.0014 1.0119 1.0122 1.0125 1.0153 1.0018 0.9950 0.9940
dispcorr: -0.022484914 hartree
energy: -2327.157678152165
dipole: 31.80556 -28.34841 3.45715 -0.86645 -1.21265 -2.07910 3.78051 -3.27958 0.50093
magnitude: 4.06515 au
magnitude: 10.33279 debye
