program: Orca
programVersion: 5.0.2
elementType: Cl S S F O O O N N N C C C C C C C C C C C C C C C H H H H H H H H H H H H H H H
charge: 0
multiplicity: 1
keywords: wb97x-d3
keywords: def2-TZVPP
keywords: def2/J RIJCOSX
keywords: DEFGRID2
keywords: scfconv7
keywords: smallprint printgap noloewdin
keywords: NOSOSCF
formula: C15H15ClFN3O3S2
InChI: InChI=1/C15H15ClFN3O3S2/c1-23-13(21)8-24-12-7-11(10(17)6-9(12)16)18-14-19-4-2-3-5-20(19)15(22)25-14/h6-7H,2-5,8H2,1H3
40 atoms
Cl -5.010314 -1.662627 -0.720926
S  1.340731 0.644723 -1.179999
S  -3.701825 1.04848 0.062766
F  -0.510211 -3.85525 -0.420394
O  3.542222 1.984014 -1.783169
O  -0.629378 3.486842 0.28507
O  -1.95409 2.749699 1.927652
N  2.943104 -0.76258 0.258165
N  3.738561 0.130273 -0.456525
N  0.802266 -1.614327 0.279166
C  4.936931 -1.837193 1.185597
C  5.792182 -0.921953 0.325361
C  3.577355 -2.051117 0.55202
C  5.069284 0.388527 0.087403
C  1.628503 -0.726262 -0.102589
C  3.077254 1.031673 -1.199574
C  -0.549677 -1.547928 0.011508
C  -1.326637 -0.398669 0.150419
C  -1.218048 -2.726319 -0.320989
C  -2.697247 -0.392933 -0.09735
C  -2.572994 -2.768148 -0.545188
C  -3.307888 -1.597009 -0.439515
C  -2.561091 2.36922 -0.37789
C  -1.698982 2.871016 0.756188
C  0.30106 4.020713 1.231211
H  5.410341 -2.811808 1.306216
H  4.815583 -1.409583 2.183884
H  6.743601 -0.707175 0.812155
H  6.015043 -1.399843 -0.631673
H  3.663418 -2.629784 -0.372616
H  2.915362 -2.584486 1.226492
H  4.971235 0.953928 1.017735
H  5.59809 1.005635 -0.633847
H  -0.842973 0.495225 0.517742
H  -3.049621 -3.703075 -0.809135
H  -1.960829 2.085031 -1.242553
H  -3.192439 3.202676 -0.702286
H  0.710146 3.235188 1.865785
H  -0.158154 4.790312 1.850698
H  1.101402 4.461129 0.64425
elementType: Cl S F O N C H
totalener: -2327.13587913 hartree
nucrepener: 2758.74418713 hartree
electener: -5085.88006627 hartree
oneelecener: -8686.88874678 hartree
twoeener: 3601.00868052 hartree
cpcmener: -0.04390146 hartree
kineticenergy: 2320.83433368 hartree
xcener: -159.147356070531 hartree
chargesum: 0.0000000
charge: -0.077153 -0.009542 -0.075235 -0.210052 -0.488673 -0.280251 -0.460598 -0.055508 -0.022724 -0.397218 -0.117699 -0.111062 -0.053563 -0.063014 0.231020 0.294111 0.130934 -0.216080 0.175309 -0.004637 -0.165113 0.039363 -0.120311 0.405458 -0.134015 0.084632 0.078887 0.084053 0.079827 0.115667 0.101307 0.121851 0.101769 0.201660 0.134881 0.143918 0.154605 0.120968 0.129687 0.132541
qa: -0.0772 -0.0095 -0.0752 -0.2101 -0.4887 -0.2803 -0.4606 -0.0555 -0.0227 -0.3972 -0.1177 -0.1111 -0.0536 -0.0630 0.2310 0.2941 0.1309 -0.2161 0.1753 -0.0046 -0.1651 0.0394 -0.1203 0.4055 -0.1340 0.0846 0.0789 0.0841 0.0798 0.1157 0.1013 0.1219 0.1018 0.2017 0.1349 0.1439 0.1546 0.1210 0.1297 0.1325
va: 1.2519 2.5078 2.3364 1.0814 2.0230 2.1197 2.0418 3.1074 3.1199 2.9717 3.9195 3.9116 3.8940 3.9000 4.1776 4.3381 3.7848 3.9017 4.1456 3.9554 3.9812 3.8880 3.8823 4.1471 3.8431 1.0147 1.0158 1.0158 1.0160 1.0046 1.0221 1.0007 1.0197 0.9674 1.0127 1.0148 1.0039 0.9919 0.9948 0.9940
dispcorr: -0.021244583 hartree
energy: -2327.157123718018
dipole: 38.28180 -34.89477 3.38702 11.24980 -11.34667 -0.09687 9.15370 -8.93150 0.22220
magnitude: 3.39569 au
magnitude: 8.63115 debye
