program: Orca
programVersion: 5.0.2
elementType: Cl S S F O O O N N N C C C C C C C C C C C C C C C H H H H H H H H H H H H H H H
charge: 0
multiplicity: 1
keywords: wb97x-d3
keywords: def2-TZVPP
keywords: def2/J RIJCOSX
keywords: DEFGRID2
keywords: scfconv7
keywords: smallprint printgap noloewdin
keywords: NOSOSCF
formula: C15H15ClFN3O3S2
InChI: InChI=1/C15H15ClFN3O3S2/c1-23-13(21)8-24-12-7-11(10(17)6-9(12)16)18-14-19-4-2-3-5-20(19)15(22)25-14/h6-7H,2-5,8H2,1H3
40 atoms
Cl -4.551115 -0.521265 0.544054
S  1.877475 0.764342 0.317137
S  -2.887318 1.125491 -1.665718
F  -0.393515 -3.153192 1.468922
O  4.184478 2.025782 0.630727
O  -4.032306 3.162701 0.6431
O  -2.257555 2.166976 1.569513
N  3.386559 -1.20619 -0.373602
N  4.237261 -0.188461 0.055015
N  1.155962 -1.800749 -0.278332
C  5.290626 -2.726191 -0.61643
C  6.189749 -1.640575 -0.048437
C  3.872326 -2.564721 -0.108934
C  5.625308 -0.274047 -0.384894
C  2.068316 -0.921446 -0.170022
C  3.645995 0.974727 0.367251
C  -0.173755 -1.449618 -0.123068
C  -0.808662 -0.458152 -0.864009
C  -0.964645 -2.169813 0.772139
C  -2.15424 -0.148794 -0.682563
C  -2.297622 -1.899631 0.974274
C  -2.889394 -0.873771 0.250029
C  -2.255597 2.591406 -0.782073
C  -2.82539 2.623645 0.605756
C  -4.708034 3.170322 1.903769
H  5.298288 -2.687178 -1.708386
H  5.643383 -3.715953 -0.325812
H  6.274162 -1.74757 1.035713
H  7.195299 -1.711189 -0.462943
H  3.199798 -3.24739 -0.618524
H  3.815153 -2.76625 0.965075
H  6.173758 0.515744 0.121054
H  5.672288 -0.089503 -1.461232
H  -0.250756 0.075472 -1.623967
H  -2.861988 -2.47373 1.697242
H  -1.168131 2.561908 -0.744711
H  -2.566085 3.454208 -1.371894
H  -4.168626 3.765817 2.639664
H  -4.849185 2.159439 2.285595
H  -5.677817 3.622225 1.718287
elementType: Cl S F O N C H
totalener: -2327.13684195 hartree
nucrepener: 2746.22456175 hartree
electener: -5073.36140370 hartree
oneelecener: -8663.12552007 hartree
twoeener: 3589.76411637 hartree
cpcmener: -0.04215206 hartree
kineticenergy: 2320.84949447 hartree
xcener: -159.145203680912 hartree
chargesum: -0.0000000
charge: -0.070059 -0.001456 -0.102561 -0.205240 -0.488009 -0.275665 -0.471685 -0.060084 -0.021421 -0.384079 -0.116971 -0.109023 -0.052519 -0.064072 0.226809 0.289149 0.113359 -0.181577 0.192147 0.029891 -0.145992 0.036992 -0.113339 0.399923 -0.112496 0.078270 0.084258 0.079101 0.083713 0.101877 0.115085 0.101374 0.121043 0.155686 0.137623 0.126293 0.145449 0.121981 0.105000 0.131223
qa: -0.0701 -0.0015 -0.1026 -0.2052 -0.4880 -0.2757 -0.4717 -0.0601 -0.0214 -0.3841 -0.1170 -0.1090 -0.0525 -0.0641 0.2268 0.2891 0.1134 -0.1816 0.1921 0.0299 -0.1460 0.0370 -0.1133 0.3999 -0.1125 0.0783 0.0843 0.0791 0.0837 0.1019 0.1151 0.1014 0.1210 0.1557 0.1376 0.1263 0.1454 0.1220 0.1050 0.1312
va: 1.2518 2.5182 2.2143 1.0908 2.0246 2.1198 2.0060 3.1044 3.1193 2.9654 3.9210 3.9100 3.8950 3.9016 4.1809 4.3496 3.8002 3.9756 4.1642 3.7945 3.9652 3.8508 3.8954 4.1361 3.8453 1.0161 1.0144 1.0162 1.0159 1.0205 1.0048 1.0199 1.0009 1.0112 1.0114 1.0133 1.0165 0.9938 1.0010 0.9939
dispcorr: -0.021600008 hartree
energy: -2327.158441958795
dipole: 26.86308 -25.08971 1.77336 1.99553 -2.91175 -0.91622 -1.64902 0.82606 -0.82296
magnitude: 2.15906 au
magnitude: 5.48790 debye
