program: Orca
programVersion: 5.0.2
elementType: Cl S S F O O O N N N C C C C C C C C C C C C C C C H H H H H H H H H H H H H H H
charge: 0
multiplicity: 1
keywords: wb97x-d3
keywords: def2-TZVPP
keywords: def2/J RIJCOSX
keywords: DEFGRID2
keywords: scfconv7
keywords: smallprint printgap noloewdin
keywords: NOSOSCF
formula: C15H15ClFN3O3S2
InChI: InChI=1/C15H15ClFN3O3S2/c1-23-13(21)8-24-12-7-11(10(17)6-9(12)16)18-14-19-4-2-3-5-20(19)15(22)25-14/h6-7H,2-5,8H2,1H3
40 atoms
Cl -4.702008 -1.211112 -1.014406
S  1.567712 0.110628 -1.280362
S  -3.959943 0.865102 1.164733
F  0.051168 -2.841993 -0.985779
O  3.866222 0.850377 -2.369805
O  -2.389582 2.788359 -0.435837
O  -0.903448 3.27576 1.156436
N  3.070858 -0.614562 0.679175
N  3.927249 -0.21173 -0.344633
N  0.835727 -1.125917 1.025331
C  4.975824 -1.286378 2.054437
C  5.892989 -0.958803 0.888029
C  3.596686 -1.664458 1.553344
C  5.287006 0.146812 0.046219
C  1.762722 -0.638137 0.304246
C  3.330866 0.309848 -1.429623
C  -0.460965 -1.119833 0.525108
C  -1.424429 -0.264575 1.04927
C  -0.858959 -2.005226 -0.471922
C  -2.730707 -0.250176 0.571513
C  -2.15203 -2.049566 -0.942352
C  -3.080926 -1.16514 -0.420247
C  -2.948613 2.222205 1.791081
C  -1.962743 2.811268 0.809626
C  -1.517033 3.31851 -1.438425
H  5.367747 -2.121309 2.63528
H  4.902169 -0.428388 2.727041
H  6.869145 -0.626495 1.24102
H  6.052996 -1.846761 0.2720
H  3.625404 -2.61289 1.008668
H  2.899734 -1.767356 2.379464
H  5.265527 1.088761 0.600193
H  5.854123 0.301294 -0.867588
H  -1.119848 0.388011 1.856195
H  -2.425582 -2.755302 -1.715491
H  -3.666985 3.002443 2.061807
H  -2.425106 1.955476 2.707777
H  -1.320818 4.377213 -1.274694
H  -2.037217 3.190261 -2.382625
H  -0.575311 2.771174 -1.468522
elementType: Cl S F O N C H
totalener: -2327.13642305 hartree
nucrepener: 2782.06207789 hartree
electener: -5109.19850094 hartree
oneelecener: -8734.14195237 hartree
twoeener: 3624.94345143 hartree
cpcmener: -0.04114042 hartree
kineticenergy: 2320.85274520 hartree
xcener: -159.149404247070 hartree
chargesum: 0.0000000
charge: -0.076378 -0.002113 -0.069938 -0.212176 -0.486273 -0.268966 -0.470334 -0.051086 -0.023085 -0.364185 -0.115656 -0.109233 -0.054931 -0.064917 0.231070 0.295973 -0.050384 -0.121688 0.241807 0.019799 -0.159188 0.047904 -0.097576 0.391024 -0.116286 0.084542 0.078277 0.083817 0.079633 0.114988 0.103239 0.121580 0.101544 0.137421 0.137734 0.153262 0.127371 0.125024 0.129906 0.108477
qa: -0.0764 -0.0021 -0.0699 -0.2122 -0.4863 -0.2690 -0.4703 -0.0511 -0.0231 -0.3642 -0.1157 -0.1092 -0.0549 -0.0649 0.2311 0.2960 -0.0504 -0.1217 0.2418 0.0198 -0.1592 0.0479 -0.0976 0.3910 -0.1163 0.0845 0.0783 0.0838 0.0796 0.1150 0.1032 0.1216 0.1015 0.1374 0.1377 0.1533 0.1274 0.1250 0.1299 0.1085
va: 1.2533 2.5106 2.3558 1.0771 2.0262 2.1322 2.0265 3.1029 3.1161 2.9769 3.9188 3.9116 3.8934 3.9025 4.1643 4.3350 3.9743 3.8749 4.0174 3.8633 4.0127 3.9088 3.9453 4.1346 3.8514 1.0146 1.0163 1.0159 1.0158 1.0043 1.0178 1.0005 1.0189 1.0249 1.0104 0.9966 1.0169 0.9944 0.9951 0.9951
dispcorr: -0.021601751 hartree
energy: -2327.158024799236
dipole: 32.06536 -30.30798 1.75738 9.18460 -9.50511 -0.32052 11.35360 -9.95079 1.40281
magnitude: 2.27134 au
magnitude: 5.77330 debye
