program: Orca
programVersion: 5.0.2
elementType: Cl S S F O O O N N N C C C C C C C C C C C C C C C H H H H H H H H H H H H H H H
charge: 0
multiplicity: 1
keywords: wb97x-d3
keywords: def2-TZVPP
keywords: def2/J RIJCOSX
keywords: DEFGRID2
keywords: scfconv7
keywords: smallprint printgap noloewdin
keywords: NOSOSCF
formula: C15H15ClFN3O3S2
InChI: InChI=1/C15H15ClFN3O3S2/c1-23-13(21)8-24-12-7-11(10(17)6-9(12)16)18-14-19-4-2-3-5-20(19)15(22)25-14/h6-7H,2-5,8H2,1H3
40 atoms
Cl -4.609104 -1.271632 0.224952
S  1.942154 -2.269155 -0.000023
S  -3.49501 0.76802 -2.017067
F  0.014337 -1.400008 2.144151
O  4.30645 -3.445965 -0.181746
O  -2.530953 3.457629 -0.799112
O  -3.42132 2.667501 1.090779
N  3.350246 -0.140925 0.307119
N  4.247157 -1.167721 0.021221
N  1.08635 0.312421 0.215484
C  5.170863 1.49324 0.280441
C  6.120203 0.382411 -0.134685
C  3.757834 1.183516 -0.170728
C  5.636041 -0.944469 0.414419
C  2.0460 -0.523673 0.209842
C  3.714181 -2.395927 -0.078686
C  -0.232805 -0.107305 0.199464
C  -1.113204 0.393449 -0.757002
C  -0.781323 -0.942293 1.171305
C  -2.461062 0.057062 -0.772638
C  -2.111144 -1.30453 1.188083
C  -2.949649 -0.809687 0.204676
C  -4.368591 2.008818 -1.005114
C  -3.407367 2.745713 -0.113932
C  -1.486832 4.102859 -0.065154
H  5.192373 1.620058 1.365433
H  5.46684 2.444201 -0.162741
H  6.187913 0.32849 -1.223811
H  7.125201 0.565926 0.245408
H  3.054167 1.900203 0.240717
H  3.67982 1.214237 -1.261572
H  6.219207 -1.77219 0.020336
H  5.706343 -0.962576 1.504961
H  -0.72818 1.074963 -1.50396
H  -2.4804 -1.959449 1.966254
H  -4.847528 2.689707 -1.711625
H  -5.140106 1.538476 -0.399862
H  -0.861475 4.592078 -0.805848
H  -0.88795 3.379621 0.488624
H  -1.884018 4.85023 0.620852
elementType: Cl S F O N C H
totalener: -2327.13539400 hartree
nucrepener: 2745.11520299 hartree
electener: -5072.25059698 hartree
oneelecener: -8660.24065142 hartree
twoeener: 3587.99005444 hartree
cpcmener: -0.04083654 hartree
kineticenergy: 2320.86537895 hartree
xcener: -159.147758686260 hartree
chargesum: 0.0000000
charge: -0.069355 0.009823 -0.096467 -0.207496 -0.487659 -0.279468 -0.461568 -0.055105 -0.021908 -0.373482 -0.116146 -0.109893 -0.055477 -0.064919 0.216785 0.284257 0.059966 -0.183417 0.254243 0.024486 -0.157698 0.069756 -0.159185 0.425230 -0.122080 0.078001 0.084455 0.079498 0.084365 0.102933 0.116181 0.102651 0.121805 0.123844 0.139367 0.150355 0.120473 0.132169 0.113510 0.127173
qa: -0.0694 0.0098 -0.0965 -0.2075 -0.4877 -0.2795 -0.4616 -0.0551 -0.0219 -0.3735 -0.1161 -0.1099 -0.0555 -0.0649 0.2168 0.2843 0.0600 -0.1834 0.2542 0.0245 -0.1577 0.0698 -0.1592 0.4252 -0.1221 0.0780 0.0845 0.0795 0.0844 0.1029 0.1162 0.1027 0.1218 0.1238 0.1394 0.1504 0.1205 0.1322 0.1135 0.1272
va: 1.2534 2.5193 2.2155 1.0822 2.0251 2.1186 2.0315 3.1060 3.1158 2.9343 3.9215 3.9104 3.8979 3.9009 4.2098 4.3512 3.8688 4.0068 3.9770 3.7977 4.0278 3.8608 3.9214 4.1312 3.8438 1.0162 1.0145 1.0160 1.0157 1.0182 1.0044 1.0194 1.0006 1.0378 1.0119 1.0094 1.0233 0.9940 0.9915 0.9949
dispcorr: -0.021775607 hartree
energy: -2327.157169604461
dipole: 30.48151 -28.05849 2.42302 23.40493 -20.70911 2.69582 -2.79389 2.26846 -0.52543
magnitude: 3.66259 au
magnitude: 9.30957 debye
