program: Orca
programVersion: 5.0.2
elementType: Cl S S F O O O N N N C C C C C C C C C C C C C C C H H H H H H H H H H H H H H H
charge: 0
multiplicity: 1
keywords: wb97x-d3
keywords: def2-TZVPP
keywords: def2/J RIJCOSX
keywords: DEFGRID2
keywords: scfconv7
keywords: smallprint printgap noloewdin
keywords: NOSOSCF
formula: C15H15ClFN3O3S2
InChI: InChI=1/C15H15ClFN3O3S2/c1-23-13(21)8-24-12-7-11(10(17)6-9(12)16)18-14-19-4-2-3-5-20(19)15(22)25-14/h6-7H,2-5,8H2,1H3
40 atoms
Cl -4.606002 -0.569066 0.379212
S  1.906179 0.886342 0.037793
S  -2.90142 1.211525 -1.689652
F  -0.42858 -3.157155 1.3365
O  4.24283 2.117572 0.258363
O  -3.981485 3.099986 0.773852
O  -2.163146 2.086987 1.585515
N  3.379742 -1.186236 -0.38521
N  4.246502 -0.14483 -0.068637
N  1.143916 -1.723672 -0.291632
C  5.247665 -2.76716 -0.394974
C  6.163792 -1.635396 0.0415
C  3.82444 -2.509711 0.060011
C  5.634366 -0.313188 -0.480142
C  2.062871 -0.851685 -0.258496
C  3.68119 1.060869 0.10612
C  -0.192511 -1.395667 -0.189501
C  -0.826265 -0.392964 -0.917786
C  -0.998304 -2.162539 0.654681
C  -2.18078 -0.110658 -0.760815
C  -2.342022 -1.926267 0.821598
C  -2.931254 -0.88305 0.119791
C  -2.252627 2.629842 -0.741152
C  -2.769958 2.580579 0.668019
C  -4.609543 3.036877 2.054551
H  5.272933 -2.871795 -1.48274
H  5.573092 -3.717838 0.028965
H  6.228878 -1.598991 1.132135
H  7.174583 -1.78239 -0.340384
H  3.14013 -3.235959 -0.368842
H  3.746798 -2.568156 1.150821
H  6.19547 0.526876 -0.078844
H  5.690896 -0.274813 -1.572053
H  -0.264103 0.173038 -1.650497
H  -2.917514 -2.538183 1.503891
H  -1.164179 2.614294 -0.744622
H  -2.593139 3.521475 -1.269033
H  -4.064257 3.623328 2.794543
H  -4.7040 2.009286 2.40609
H  -5.60058 3.461859 1.921703
elementType: Cl S F O N C H
totalener: -2327.14265390 hartree
nucrepener: 2746.52924802 hartree
electener: -5073.67190192 hartree
oneelecener: -8663.62725208 hartree
twoeener: 3589.95535016 hartree
cpcmener: -0.03429297 hartree
kineticenergy: 2320.86070393 hartree
xcener: -159.145752761579 hartree
chargesum: 0.0000000
charge: -0.070082 -0.009727 -0.098940 -0.203671 -0.456001 -0.271351 -0.442517 -0.061548 -0.024124 -0.385712 -0.115836 -0.112055 -0.055670 -0.066074 0.228997 0.273708 0.136233 -0.188447 0.192087 0.016414 -0.146411 0.043180 -0.118775 0.382325 -0.114187 0.077176 0.083670 0.079187 0.083719 0.102609 0.112873 0.102426 0.118532 0.152370 0.134553 0.124346 0.142775 0.120815 0.104064 0.129068
qa: -0.0701 -0.0097 -0.0989 -0.2037 -0.4560 -0.2714 -0.4425 -0.0615 -0.0241 -0.3857 -0.1158 -0.1121 -0.0557 -0.0661 0.2290 0.2737 0.1362 -0.1884 0.1921 0.0164 -0.1464 0.0432 -0.1188 0.3823 -0.1142 0.0772 0.0837 0.0792 0.0837 0.1026 0.1129 0.1024 0.1185 0.1524 0.1346 0.1243 0.1428 0.1208 0.1041 0.1291
va: 1.2512 2.5090 2.2203 1.0922 2.0649 2.1195 2.0421 3.0983 3.1048 2.9712 3.9131 3.9053 3.8973 3.9013 4.1790 4.3719 3.7988 3.9828 4.1500 3.8269 3.9744 3.8612 3.8980 4.1607 3.8528 1.0166 1.0147 1.0166 1.0160 1.0221 1.0056 1.0213 1.0017 1.0125 1.0128 1.0115 1.0169 0.9938 1.0009 0.9937
dispcorr: -0.021631644 hartree
energy: -2327.164285542915
dipole: 26.96646 -25.28090 1.68556 1.49603 -2.39572 -0.89968 0.67175 -1.10290 -0.43115
magnitude: 1.95868 au
magnitude: 4.97856 debye
