program: Orca
programVersion: 5.0.2
elementType: Cl S S F O O O N N N C C C C C C C C C C C C C C C H H H H H H H H H H H H H H H
charge: 0
multiplicity: 1
keywords: wb97x-d3
keywords: def2-TZVPP
keywords: def2/J RIJCOSX
keywords: DEFGRID2
keywords: scfconv7
keywords: smallprint printgap noloewdin
keywords: NOSOSCF
formula: C15H15ClFN3O3S2
InChI: InChI=1/C15H15ClFN3O3S2/c1-23-13(21)8-24-12-7-11(10(17)6-9(12)16)18-14-19-4-2-3-5-20(19)15(22)25-14/h6-7H,2-5,8H2,1H3
40 atoms
Cl -4.788431 -0.967695 0.917844
S  1.766002 -0.05603 1.861786
S  -2.969036 1.701567 1.058686
F  -0.683613 -3.479057 -0.458946
O  4.096921 0.77151 2.80234
O  -1.786967 2.915061 -1.484261
O  -3.067868 1.520356 -2.665697
N  3.200219 -0.929717 -0.086071
N  4.0632 -0.215734 0.739869
N  0.953343 -1.321788 -0.425737
C  5.012472 -1.393073 -1.654467
C  5.92477 -0.522503 -0.805485
C  3.568676 -0.955185 -1.500883
C  5.479715 -0.556123 0.643681
C  1.894131 -0.858089 0.28787
C  3.520855 0.245109 1.882998
C  -0.374868 -1.185515 -0.070644
C  -0.973369 0.028288 0.264897
C  -1.211032 -2.300957 -0.121239
C  -2.325592 0.126727 0.580254
C  -2.554459 -2.241528 0.17334
C  -3.108879 -1.023944 0.536491
C  -3.78861 2.193702 -0.486234
C  -2.855693 2.16072 -1.667625
C  -0.811212 2.939529 -2.525577
H  5.281739 -1.325321 -2.709116
H  5.111957 -2.441481 -1.361318
H  6.95607 -0.872959 -0.857291
H  5.912864 0.507492 -1.171103
H  3.413883 0.038043 -1.935061
H  2.893674 -1.650775 -1.991653
H  5.63828 -1.548585 1.075439
H  6.026267 0.169151 1.241103
H  -0.381212 0.934369 0.25613
H  -3.155207 -3.140452 0.128213
H  -4.651045 1.560337 -0.684922
H  -4.147885 3.212618 -0.319588
H  -0.397464 1.947893 -2.710001
H  -0.019817 3.597174 -2.177035
H  -1.225015 3.337146 -3.452428
elementType: Cl S F O N C H
totalener: -2327.14233642 hartree
nucrepener: 2744.24253597 hartree
electener: -5071.38487238 hartree
oneelecener: -8658.10696549 hartree
twoeener: 3586.72209311 hartree
cpcmener: -0.03474998 hartree
kineticenergy: 2320.86188899 hartree
xcener: -159.146135351595 hartree
chargesum: -0.0000000
charge: -0.070943 0.000322 -0.098416 -0.203887 -0.451981 -0.274847 -0.440730 -0.049685 -0.034923 -0.397232 -0.115496 -0.111289 -0.061287 -0.065335 0.228905 0.272222 0.123285 -0.175514 0.203573 0.014552 -0.165133 0.062899 -0.144567 0.410389 -0.127597 0.083842 0.077973 0.083687 0.078817 0.113815 0.105133 0.119453 0.102898 0.143473 0.133711 0.115696 0.143783 0.115860 0.129182 0.125395
qa: -0.0709 0.0003 -0.0984 -0.2039 -0.4520 -0.2748 -0.4407 -0.0497 -0.0349 -0.3972 -0.1155 -0.1113 -0.0613 -0.0653 0.2289 0.2722 0.1233 -0.1755 0.2036 0.0146 -0.1651 0.0629 -0.1446 0.4104 -0.1276 0.0838 0.0780 0.0837 0.0788 0.1138 0.1051 0.1195 0.1029 0.1435 0.1337 0.1157 0.1438 0.1159 0.1292 0.1254
va: 1.2512 2.5035 2.2159 1.0929 2.0674 2.1125 2.0608 3.1074 3.1008 2.9473 3.9140 3.9062 3.8930 3.9037 4.1813 4.3632 3.7721 3.9493 4.1563 3.8478 3.9822 3.8566 3.9309 4.1286 3.8481 1.0150 1.0167 1.0159 1.0163 1.0039 1.0223 1.0011 1.0194 1.0260 1.0131 1.0271 1.0074 0.9931 0.9943 0.9950
dispcorr: -0.021296656 hartree
energy: -2327.163633073371
dipole: 32.76077 -30.19414 2.56664 9.60955 -9.32409 0.28546 -17.38657 15.67632 -1.71024
magnitude: 3.09742 au
magnitude: 7.87302 debye
