program: Orca
programVersion: 5.0.2
elementType: Cl S S F O O O N N N C C C C C C C C C C C C C C C H H H H H H H H H H H H H H H
charge: 0
multiplicity: 1
keywords: wb97x-d3
keywords: def2-TZVPP
keywords: def2/J RIJCOSX
keywords: DEFGRID2
keywords: scfconv7
keywords: smallprint printgap noloewdin
keywords: NOSOSCF
formula: C15H15ClFN3O3S2
InChI: InChI=1/C15H15ClFN3O3S2/c1-23-13(21)8-24-12-7-11(10(17)6-9(12)16)18-14-19-4-2-3-5-20(19)15(22)25-14/h6-7H,2-5,8H2,1H3
40 atoms
Cl -4.776141 -1.06245 0.637501
S  1.634768 0.126661 1.450343
S  -3.667569 0.678357 -1.861402
F  -0.090776 -2.679798 1.349213
O  3.938882 0.863688 2.548088
O  -1.848143 2.973145 -0.957648
O  -2.630633 2.704619 1.118477
N  3.178556 -0.819041 -0.389255
N  4.021236 -0.378367 0.629919
N  0.950879 -1.255348 -0.796079
C  5.069471 -1.643122 -1.67155
C  5.989138 -1.1707 -0.552554
C  3.688184 -1.967411 -1.127372
C  5.358043 -0.006799 0.19475
C  1.850086 -0.749929 -0.066837
C  3.406098 0.2709 1.655618
C  -0.384051 -1.171725 -0.426554
C  -1.271963 -0.383394 -1.150349
C  -0.909744 -1.906941 0.633354
C  -2.626345 -0.319839 -0.843912
C  -2.247229 -1.870478 0.965752
C  -3.107022 -1.080163 0.221037
C  -4.006684 2.058287 -0.727528
C  -2.765555 2.607939 -0.068084
C  -0.620567 3.464737 -0.43534
H  4.983495 -0.867028 -2.436813
H  5.477572 -2.529568 -2.158878
H  6.180254 -1.988239 0.14739
H  6.954696 -0.856562 -0.951636
H  2.978832 -2.171591 -1.924989
H  3.724708 -2.844409 -0.470812
H  5.926266 0.256325 1.08365
H  5.301265 0.877804 -0.449435
H  -0.893176 0.194872 -1.982044
H  -2.611219 -2.458754 1.796619
H  -4.475983 2.826572 -1.346888
H  -4.712428 1.760707 0.04482
H  -0.010736 3.720633 -1.297484
H  -0.108729 2.708289 0.161236
H  -0.769957 4.352054 0.180353
totalener: -2327.11493814 hartree
nucrepener: 2773.86717531 hartree
electener: -5100.98211345 hartree
oneelecener: -8717.21017656 hartree
twoeener: 3616.22806310 hartree
kineticenergy: 2320.91417415 hartree
xcener: -159.144186384855 hartree
chargesum: 0.0000000
charge: -0.059498 0.013625 -0.060438 -0.193625 -0.343890 -0.261674 -0.337294 -0.054556 -0.056752 -0.329476 -0.122782 -0.121757 -0.074920 -0.083856 0.203914 0.243862 0.008576 -0.155587 0.249359 -0.006251 -0.160608 0.100666 -0.167573 0.337102 -0.122006 0.075966 0.080799 0.079128 0.080243 0.108971 0.102036 0.108288 0.103407 0.120242 0.119298 0.120219 0.123780 0.117180 0.096275 0.119610
qa: -0.0595 0.0136 -0.0604 -0.1936 -0.3439 -0.2617 -0.3373 -0.0546 -0.0568 -0.3295 -0.1228 -0.1218 -0.0749 -0.0839 0.2039 0.2439 0.0086 -0.1556 0.2494 -0.0063 -0.1606 0.1007 -0.1676 0.3371 -0.1220 0.0760 0.0808 0.0791 0.0802 0.1090 0.1020 0.1083 0.1034 0.1202 0.1193 0.1202 0.1238 0.1172 0.0963 0.1196
va: 1.2633 2.4990 2.2470 1.1038 2.1744 2.1121 2.1619 3.0500 3.0480 2.9762 3.8817 3.8814 3.9085 3.9239 4.1763 4.3683 3.9245 3.9866 4.0373 3.8773 4.0257 3.8619 3.9337 4.1839 3.8865 1.0198 1.0173 1.0192 1.0180 1.0246 1.0102 1.0231 1.0063 1.0376 1.0180 1.0108 1.0218 0.9933 0.9978 0.9994
dispcorr: -0.022176855 hartree
energy: -2327.137114997806
dipole: 33.19889 -31.27807 1.92082 7.81605 -8.06983 -0.25379 -11.65559 10.23588 -1.41971
magnitude: 2.40199 au
magnitude: 6.10537 debye
