program: Orca
programVersion: 5.0.2
elementType: Cl S S F O O O N N N C C C C C C C C C C C C C C C H H H H H H H H H H H H H H H
charge: 0
multiplicity: 1
keywords: wb97x-d3
keywords: def2-TZVPP
keywords: def2/J RIJCOSX
keywords: DEFGRID2
keywords: scfconv7
keywords: smallprint printgap noloewdin
keywords: NOSOSCF
formula: C15H15ClFN3O3S2
InChI: InChI=1/C15H15ClFN3O3S2/c1-23-13(21)8-24-12-7-11(10(17)6-9(12)16)18-14-19-4-2-3-5-20(19)15(22)25-14/h6-7H,2-5,8H2,1H3
40 atoms
Cl -4.730857 -0.751208 -0.913925
S  1.893426 0.286711 -1.395306
S  -3.73123 0.367143 1.954792
F  0.006571 -2.085228 -1.838167
O  4.300884 1.197963 -2.049376
O  -2.544155 2.378245 -0.612175
O  -1.87613 3.071614 1.408135
N  3.214178 -1.016759 0.391975
N  4.136147 -0.173013 -0.226611
N  0.939563 -1.243296 0.65846
C  4.92166 -1.837758 1.917276
C  5.91938 -0.899633 1.250222
C  3.509256 -1.292139 1.792646
C  5.512203 -0.641347 -0.190471
C  1.920546 -0.781088 0.009441
C  3.661016 0.534312 -1.286357
C  -0.370841 -1.076772 0.248725
C  -1.30147 -0.504552 1.112949
C  -0.850566 -1.526928 -0.97927
C  -2.643845 -0.378835 0.780452
C  -2.178534 -1.429856 -1.339533
C  -3.07753 -0.861039 -0.454073
C  -4.009111 1.988389 1.161103
C  -2.694298 2.562355 0.695944
C  -1.287667 2.737307 -1.171978
H  4.969758 -2.826436 1.453404
H  5.158727 -1.967871 2.974077
H  5.96202 0.049789 1.790286
H  6.923762 -1.32501 1.266933
H  2.769751 -2.009815 2.136958
H  3.391784 -0.375852 2.383103
H  6.127502 0.127315 -0.651653
H  5.603266 -1.556386 -0.786214
H  -0.959157 -0.140125 2.071846
H  -2.503525 -1.804346 -2.300375
H  -4.726197 1.893879 0.347971
H  -4.429483 2.61996 1.943517
H  -1.104383 3.809222 -1.09402
H  -1.334802 2.450788 -2.218929
H  -0.468481 2.204754 -0.688211
totalener: -2327.11448313 hartree
nucrepener: 2789.86594246 hartree
electener: -5116.98042559 hartree
oneelecener: -8749.09382179 hartree
twoeener: 3632.11339620 hartree
kineticenergy: 2320.92350122 hartree
xcener: -159.147311964409 hartree
chargesum: 0.0000000
charge: -0.058580 -0.004408 -0.055186 -0.194728 -0.345497 -0.254198 -0.342000 -0.058373 -0.057365 -0.325772 -0.123159 -0.122579 -0.071618 -0.083996 0.221037 0.243876 -0.012685 -0.116442 0.282484 -0.048941 -0.190210 0.124770 -0.187540 0.337399 -0.120505 0.076914 0.081073 0.078454 0.080489 0.107598 0.101554 0.108225 0.105499 0.116590 0.118595 0.117884 0.134058 0.123991 0.122196 0.091096
qa: -0.0586 -0.0044 -0.0552 -0.1947 -0.3455 -0.2542 -0.3420 -0.0584 -0.0574 -0.3258 -0.1232 -0.1226 -0.0716 -0.0840 0.2210 0.2439 -0.0127 -0.1164 0.2825 -0.0489 -0.1902 0.1248 -0.1875 0.3374 -0.1205 0.0769 0.0811 0.0785 0.0805 0.1076 0.1016 0.1082 0.1055 0.1166 0.1186 0.1179 0.1341 0.1240 0.1222 0.0911
va: 1.2648 2.5008 2.2503 1.0997 2.1747 2.1105 2.1642 3.0638 3.0537 2.9783 3.8868 3.8824 3.9069 3.9228 4.1667 4.3867 3.9394 3.9719 3.9564 3.9230 4.0637 3.8019 3.9211 4.2072 3.8690 1.0194 1.0172 1.0195 1.0179 1.0257 1.0110 1.0232 1.0058 1.0405 1.0201 1.0189 1.0113 1.0008 0.9919 1.0089
dispcorr: -0.023038040 hartree
energy: -2327.137521165570
dipole: 30.31912 -28.94404 1.37508 4.45858 -5.14550 -0.68692 11.18773 -10.83741 0.35032
magnitude: 1.57653 au
magnitude: 4.00721 debye
