program: Orca
programVersion: 5.0.2
elementType: F O O O O N N C C C C C C C C C C C C C C C C C C C H H H H H H H H H H H H H H H
charge: 0
multiplicity: 1
keywords: wb97x-d3
keywords: def2-TZVPP
keywords: def2/J RIJCOSX
keywords: DEFGRID2
keywords: scfconv7
keywords: smallprint printgap noloewdin
keywords: NOSOSCF
formula: C19H15FN2O4
InChI: InChI=1/C19H15FN2O4/c1-2-7-21-15-9-14(13(20)8-16(15)26-10-17(21)23)22-18(24)11-5-3-4-6-12(11)19(22)25/h1,8-9H,3-7,10H2
41 atoms
F  0.622298 -2.926434 -0.654827
O  1.506626 1.092185 -1.987215
O  2.024822 -1.568572 1.660252
O  -3.93312 -1.781233 -0.442484
O  -5.502365 1.251367 0.402496
N  1.393065 -0.340184 -0.18428
N  -3.33572 0.853279 -0.127638
C  3.446511 0.607028 -0.616771
C  3.599152 -0.177723 0.451079
C  4.523144 1.41013 -1.246074
C  4.865208 -0.36295 1.200406
C  5.880629 0.943142 -0.717123
C  5.85854 0.726865 0.795623
C  2.033651 0.531901 -1.060408
C  2.295236 -0.809508 0.764801
C  0.035729 -0.69482 -0.248033
C  -0.956958 0.264889 -0.089621
C  -2.292742 -0.087356 -0.181587
C  -0.331286 -2.008534 -0.480925
C  -2.630063 -1.429154 -0.374163
C  -1.653939 -2.39686 -0.518129
C  -4.591058 0.466123 0.221419
C  -4.771765 -1.019481 0.408021
C  -3.055735 2.271243 -0.290545
C  -2.695185 2.92244 0.964341
C  -2.389996 3.452896 1.997613
H  4.476119 1.324603 -2.334141
H  4.361606 2.46881 -1.019006
H  4.677386 -0.342788 2.276238
H  5.26941 -1.356757 0.982977
H  6.155386 0.00758 -1.212138
H  6.645583 1.674112 -0.980772
H  5.584791 1.663015 1.290043
H  6.854816 0.463157 1.151825
H  -0.659001 1.285875 0.105799
H  -1.923968 -3.432551 -0.678733
H  -4.584896 -1.264203 1.461136
H  -5.799113 -1.287163 0.17216
H  -2.254668 2.389404 -1.021089
H  -3.931607 2.754134 -0.722266
H  -2.123482 3.934347 2.912121
elementType: F O N C H
totalener: -1243.39724049 hartree
nucrepener: 2283.52404318 hartree
electener: -3526.92128366 hartree
oneelecener: -6233.75505939 hartree
twoeener: 2706.83377572 hartree
cpcmener: -0.04830683 hartree
kineticenergy: 1238.34114480 hartree
xcener: -116.279865577537 hartree
chargesum: 0.0000000
charge: -0.209767 -0.431555 -0.430391 -0.331796 -0.509924 -0.062510 -0.075937 -0.070574 -0.076527 -0.073211 -0.072502 -0.135128 -0.135567 0.342829 0.349956 -0.047192 -0.153826 0.126768 0.231602 0.182785 -0.188115 0.327658 0.065514 -0.089978 -0.434440 0.080849 0.094061 0.102029 0.093877 0.102149 0.078299 0.081167 0.078741 0.081163 0.150020 0.143206 0.120539 0.118349 0.151530 0.136481 0.289370
qa: -0.2098 -0.4316 -0.4304 -0.3318 -0.5099 -0.0625 -0.0759 -0.0706 -0.0765 -0.0732 -0.0725 -0.1351 -0.1356 0.3428 0.3500 -0.0472 -0.1538 0.1268 0.2316 0.1828 -0.1881 0.3277 0.0655 -0.0900 -0.4344 0.0808 0.0941 0.1020 0.0939 0.1021 0.0783 0.0812 0.0787 0.0812 0.1500 0.1432 0.1205 0.1183 0.1515 0.1365 0.2894
va: 1.0857 2.0805 2.0860 2.0813 1.9996 3.0662 3.2063 3.7109 3.7093 3.9178 3.9169 3.9165 3.9166 4.1552 4.1647 3.7385 3.9783 3.7950 4.1010 3.9204 3.9952 4.1262 3.8444 3.8794 3.7257 3.5675 1.0149 1.0044 1.0152 1.0041 1.0068 1.0092 1.0066 1.0093 1.0138 1.0121 0.9988 1.0051 0.9871 1.0079 0.9444
dispcorr: -0.020291789 hartree
energy: -1243.417532276854
dipole: 20.69756 -18.42728 2.27028 12.29946 -11.78326 0.51621 3.15364 -3.03610 0.11754
magnitude: 2.33119 au
magnitude: 5.92541 debye
