program: Orca
programVersion: 5.0.2
elementType: F O O O O N N C C C C C C C C C C C C C C C C C C C H H H H H H H H H H H H H H H
charge: 0
multiplicity: 1
keywords: wb97x-d3
keywords: def2-TZVPP
keywords: def2/J RIJCOSX
keywords: DEFGRID2
keywords: scfconv7
keywords: smallprint printgap noloewdin
keywords: NOSOSCF
formula: C19H15FN2O4
InChI: InChI=1/C19H15FN2O4/c1-2-7-21-15-9-14(13(20)8-16(15)26-10-17(21)23)22-18(24)11-5-3-4-6-12(11)19(22)25/h1,8-9H,3-7,10H2
41 atoms
F  0.565697 -2.934533 0.838906
O  1.327265 1.329866 1.557079
O  2.18214 -1.919921 -1.505411
O  -3.951386 -1.83194 0.189581
O  -5.477287 1.316411 -0.283554
N  1.384097 -0.420449 0.054191
N  -3.313384 0.705973 -0.576603
C  3.370904 0.679801 0.433818
C  3.623139 -0.275079 -0.462124
C  4.371861 1.630687 0.975667
C  4.945039 -0.531489 -1.084566
C  5.778555 1.140216 0.629437
C  5.872826 0.655223 -0.816419
C  1.932802 0.627182 0.791367
C  2.363566 -1.008797 -0.741867
C  0.027758 -0.782327 0.074659
C  -0.947733 0.144496 -0.275407
C  -2.29049 -0.188332 -0.219892
C  -0.362517 -2.049072 0.470305
C  -2.650582 -1.481175 0.168537
C  -1.691921 -2.415034 0.512786
C  -4.587831 0.503492 -0.140172
C  -4.824434 -0.795453 0.590884
C  -2.985171 1.971489 -1.211073
C  -2.5135 2.96207 -0.248144
C  -2.102562 3.751169 0.558634
H  4.19134 2.623711 0.550884
H  4.248731 1.740053 2.055828
H  5.365748 -1.454352 -0.67207
H  4.833372 -0.705993 -2.157393
H  6.497877 1.941549 0.804009
H  6.050483 0.323456 1.304257
H  6.900636 0.375508 -1.051848
H  5.610003 1.475824 -1.490315
H  -0.625123 1.127289 -0.588574
H  -1.982205 -3.412105 0.818582
H  -4.734831 -0.604608 1.668082
H  -5.839221 -1.133211 0.389802
H  -2.22924 1.800549 -1.979041
H  -3.868587 2.340979 -1.729818
H  -1.761599 4.461203 1.279413
elementType: F O N C H
totalener: -1243.40333573 hartree
nucrepener: 2290.88452372 hartree
electener: -3534.28785946 hartree
oneelecener: -6248.64202489 hartree
twoeener: 2714.35416544 hartree
cpcmener: -0.04060742 hartree
kineticenergy: 1238.35668893 hartree
xcener: -116.280944868976 hartree
chargesum: -0.0000000
charge: -0.208125 -0.404906 -0.401807 -0.323791 -0.477548 -0.062257 -0.081275 -0.065464 -0.081075 -0.076120 -0.073402 -0.134537 -0.134955 0.315328 0.328173 -0.041438 -0.150485 0.137180 0.234742 0.156005 -0.184089 0.308406 0.063696 -0.076305 -0.426774 0.069459 0.101129 0.093834 0.100411 0.093218 0.080828 0.077554 0.080528 0.077409 0.146382 0.140039 0.115186 0.117916 0.148060 0.135459 0.283408
qa: -0.2081 -0.4049 -0.4018 -0.3238 -0.4775 -0.0623 -0.0813 -0.0655 -0.0811 -0.0761 -0.0734 -0.1345 -0.1350 0.3153 0.3282 -0.0414 -0.1505 0.1372 0.2347 0.1560 -0.1841 0.3084 0.0637 -0.0763 -0.4268 0.0695 0.1011 0.0938 0.1004 0.0932 0.0808 0.0776 0.0805 0.0774 0.1464 0.1400 0.1152 0.1179 0.1481 0.1355 0.2834
va: 1.0881 2.1123 2.1218 2.0913 2.0412 3.0604 3.2063 3.6863 3.6943 3.9194 3.9199 3.9155 3.9150 4.1869 4.1977 3.7449 3.9843 3.7994 4.1076 3.9465 3.9902 4.1520 3.8491 3.8680 3.7144 3.5958 1.0046 1.0153 1.0045 1.0155 1.0095 1.0067 1.0094 1.0069 1.0136 1.0132 0.9996 1.0039 0.9871 1.0127 0.9489
dispcorr: -0.020465344 hartree
energy: -1243.423801077634
dipole: 20.63816 -18.58139 2.05677 13.07686 -12.49771 0.57915 -1.79877 1.72683 -0.07194
magnitude: 2.13797 au
magnitude: 5.43428 debye
