program: Orca
programVersion: 5.0.2
elementType: Cl F O O O O O N C C C C C C C C C C C C C C C C C C C C C H H H H H H H H H H H H H H H H H H H H H H H
charge: 0
multiplicity: 1
keywords: wb97x-d3
keywords: def2-TZVPP
keywords: def2/J RIJCOSX
keywords: DEFGRID2
keywords: scfconv7
keywords: smallprint printgap noloewdin
keywords: NOSOSCF
formula: C21H23ClFNO5
InChI: InChI=1/C21H23ClFNO5/c1-2-3-6-9-28-19(25)12-29-18-11-17(16(23)10-15(18)22)24-20(26)13-7-4-5-8-14(13)21(24)27/h10-11H,2-9,12H2,1H3
52 atoms
Cl 4.012945 2.541828 2.588666
F  -0.902466 3.268091 1.796871
O  -1.562267 -1.131588 1.890365
O  -1.535429 2.348788 -1.031999
O  3.444523 -0.012092 1.425316
O  2.490608 -2.394547 -1.002278
O  3.352975 -0.342751 -1.301795
N  -1.264167 0.788285 0.644185
C  -5.251254 -1.264173 -0.783806
C  -4.797706 -0.619299 -2.092406
C  -4.067886 -1.626293 0.11443
C  -4.049336 0.692469 -1.851653
C  -3.085858 -0.516909 0.112218
C  -3.081545 0.505699 -0.743635
C  -1.916143 -0.387559 1.011987
C  -1.909326 1.363336 -0.449616
C  -0.013901 1.200772 1.132158
C  1.08199 0.352098 1.040006
C  0.149982 2.453693 1.690902
C  2.332405 0.749171 1.487592
C  -0.407636 -2.137696 -1.800688
C  1.383994 2.880527 2.138321
C  0.794019 -1.734122 -2.653421
C  2.466541 2.026764 2.03736
C  -1.005684 -3.505266 -2.117668
C  2.069392 -2.508737 -2.378291
C  -1.688146 -3.567492 -3.476115
C  3.326962 -1.311496 0.895235
C  3.060276 -1.276492 -0.598259
H  -5.90978 -0.57349 -0.2503
H  -5.8375 -2.159934 -0.990655
H  -4.141733 -1.311922 -2.628879
H  -5.657263 -0.436547 -2.737781
H  -4.399517 -1.843579 1.132143
H  -3.571515 -2.535076 -0.243435
H  -3.529867 1.018236 -2.755508
H  -4.746216 1.496515 -1.595611
H  0.920723 -0.622653 0.602297
H  -1.185725 -1.379367 -1.928541
H  -0.137411 -2.102622 -0.741841
H  0.981191 -0.665018 -2.534699
H  0.570515 -1.875761 -3.714406
H  1.493154 3.867392 2.568186
H  -0.23671 -4.2806 -2.05369
H  -1.73723 -3.748342 -1.342062
H  1.924903 -3.577825 -2.525539
H  2.874354 -2.188139 -3.041096
H  -2.146458 -4.542492 -3.645311
H  -2.479041 -2.817053 -3.548954
H  -0.99154 -3.391266 -4.296855
H  2.570624 -1.901572 1.419605
H  4.291194 -1.796797 1.060762
elementType: Cl F O N C H
totalener: -1805.20298824 hartree
nucrepener: 3134.86315814 hartree
electener: -4940.06614637 hartree
oneelecener: -8707.27049564 hartree
twoeener: 3767.20434927 hartree
cpcmener: -0.04934336 hartree
kineticenergy: 1798.94509691 hartree
xcener: -147.732502901196 hartree
chargesum: 0.0000000
charge: -0.070960 -0.208867 -0.421793 -0.426951 -0.314669 -0.284003 -0.459707 -0.034264 -0.128075 -0.137551 -0.091354 -0.071612 -0.061233 -0.083005 0.294268 0.359791 -0.007317 -0.147967 0.192020 0.270979 -0.146018 -0.107076 -0.143633 -0.032522 -0.124237 -0.000667 -0.274158 0.046767 0.370769 0.079773 0.080567 0.075933 0.083853 0.101524 0.107843 0.093599 0.105898 0.123849 0.062059 0.088400 0.092068 0.094578 0.135971 0.069906 0.076027 0.120747 0.118461 0.092966 0.078212 0.086035 0.132225 0.142550
qa: -0.0710 -0.2089 -0.4218 -0.4270 -0.3147 -0.2840 -0.4597 -0.0343 -0.1281 -0.1376 -0.0914 -0.0716 -0.0612 -0.0830 0.2943 0.3598 -0.0073 -0.1480 0.1920 0.2710 -0.1460 -0.1071 -0.1436 -0.0325 -0.1242 -0.0007 -0.2742 0.0468 0.3708 0.0798 0.0806 0.0759 0.0839 0.1015 0.1078 0.0936 0.1059 0.1238 0.0621 0.0884 0.0921 0.0946 0.1360 0.0699 0.0760 0.1207 0.1185 0.0930 0.0782 0.0860 0.1322 0.1425
va: 1.2398 1.0867 2.0814 2.0876 2.1051 2.1339 2.0351 3.0448 3.9073 3.9230 3.9235 3.9023 3.6404 3.6868 4.1570 4.1317 3.7041 3.9236 4.1119 3.9538 3.8881 3.9685 3.8462 3.8961 3.8984 3.8347 3.9250 3.8738 4.1009 1.0070 1.0099 1.0105 1.0120 1.0163 1.0060 1.0163 1.0028 1.0440 1.0129 1.0216 1.0281 1.0114 1.0133 1.0089 1.0050 0.9955 1.0103 1.0051 0.9940 1.0004 1.0051 0.9888
dispcorr: -0.032466595 hartree
energy: -1805.235454829909
dipole: -33.60933 31.41749 -2.19184 -41.61636 38.73564 -2.88072 -37.43578 36.27339 -1.16239
magnitude: 3.80182 au
magnitude: 9.66346 debye
