program: Orca
programVersion: 5.0.2
elementType: Cl F O O O O O N C C C C C C C C C C C C C C C C C C C C C H H H H H H H H H H H H H H H H H H H H H H H
charge: 0
multiplicity: 1
keywords: wb97x-d3
keywords: def2-TZVPP
keywords: def2/J RIJCOSX
keywords: DEFGRID2
keywords: scfconv7
keywords: smallprint printgap noloewdin
keywords: NOSOSCF
formula: C21H23ClFNO5
InChI: InChI=1/C21H23ClFNO5/c1-2-3-6-9-28-19(25)12-29-18-11-17(16(23)10-15(18)22)24-20(26)13-7-4-5-8-14(13)21(24)27/h10-11H,2-9,12H2,1H3
52 atoms
Cl 3.825466 2.79544 2.672752
F  -1.202923 2.655327 2.550878
O  -2.326151 2.895964 -0.195633
O  -0.850197 -1.325009 0.628696
O  3.553517 0.982658 0.465805
O  2.621524 -2.118899 -0.944637
O  2.980173 -1.600132 1.204767
N  -1.271226 0.93073 0.391129
C  -5.230461 -0.174942 -1.873584
C  -5.109541 -1.408737 -0.980272
C  -4.64581 1.072092 -1.208604
C  -3.651815 -1.749578 -0.668293
C  -3.347587 0.731804 -0.579371
C  -2.909291 -0.507129 -0.350643
C  -2.314685 1.694031 -0.125545
C  -1.569104 -0.426393 0.272636
C  -0.065096 1.423108 0.909486
C  1.138068 1.008804 0.35494
C  -0.048442 2.273621 1.998962
C  2.348332 1.395095 0.909489
C  0.243915 -3.208084 -2.380454
C  1.141129 2.723818 2.533865
C  1.442015 -3.989421 -1.853654
C  2.332186 2.274858 1.993615
C  -0.379075 -3.865746 -3.604343
C  2.069572 -3.409199 -0.608829
C  -1.561454 -3.086954 -4.157604
C  3.580242 -0.02894 -0.513362
C  3.023146 -1.332596 0.029778
H  -4.706701 -0.357967 -2.815964
H  -6.276365 0.003421 -2.125037
H  -5.644936 -1.231104 -0.043609
H  -5.588375 -2.264141 -1.457592
H  -4.519476 1.880109 -1.932451
H  -5.324871 1.457225 -0.441334
H  -3.582938 -2.458217 0.1601
H  -3.176501 -2.240187 -1.523722
H  1.094624 0.376709 -0.521271
H  0.539736 -2.186163 -2.635908
H  -0.510205 -3.122136 -1.590981
H  2.200757 -4.093338 -2.635084
H  1.128818 -5.005628 -1.597819
H  1.1350 3.395193 3.382167
H  0.382122 -3.972683 -4.3830
H  -0.696209 -4.880922 -3.347806
H  1.32698 -3.294798 0.182953
H  2.871742 -4.049704 -0.237482
H  -1.268142 -2.078335 -4.454428
H  -1.989079 -3.576893 -5.0333
H  -2.357097 -2.991725 -3.416297
H  4.632262 -0.182855 -0.763369
H  3.071636 0.26956 -1.433698
elementType: Cl F O N C H
totalener: -1805.20599232 hartree
nucrepener: 3067.36139956 hartree
electener: -4872.56739188 hartree
oneelecener: -8573.20969562 hartree
twoeener: 3700.64230374 hartree
cpcmener: -0.04913870 hartree
kineticenergy: 1798.96639984 hartree
xcener: -147.732619508784 hartree
chargesum: 0.0000000
charge: -0.071609 -0.209847 -0.425909 -0.435027 -0.317437 -0.273200 -0.465245 -0.056551 -0.137429 -0.133053 -0.072143 -0.079870 -0.091867 -0.036839 0.357828 0.333531 -0.002499 -0.185985 0.188872 0.289417 -0.093945 -0.110357 -0.107472 -0.021002 -0.081757 -0.020272 -0.283031 0.045605 0.379066 0.078389 0.081771 0.079932 0.081297 0.093631 0.102619 0.100769 0.093800 0.146718 0.066332 0.035702 0.071714 0.071556 0.135936 0.057075 0.057914 0.102473 0.130249 0.079512 0.095243 0.079158 0.143757 0.132481
qa: -0.0716 -0.2098 -0.4259 -0.4350 -0.3174 -0.2732 -0.4652 -0.0566 -0.1374 -0.1331 -0.0721 -0.0799 -0.0919 -0.0368 0.3578 0.3335 -0.0025 -0.1860 0.1889 0.2894 -0.0939 -0.1104 -0.1075 -0.0210 -0.0818 -0.0203 -0.2830 0.0456 0.3791 0.0784 0.0818 0.0799 0.0813 0.0936 0.1026 0.1008 0.0938 0.1467 0.0663 0.0357 0.0717 0.0716 0.1359 0.0571 0.0579 0.1025 0.1302 0.0795 0.0952 0.0792 0.1438 0.1325
va: 1.2392 1.0852 2.0898 2.0660 2.0982 2.1437 2.0316 3.0880 3.9232 3.9177 3.9158 3.9132 3.7296 3.7033 4.1633 4.1165 3.6936 3.9086 4.1223 3.8703 3.8585 3.9744 3.9338 3.9115 3.8843 3.8539 3.9453 3.8789 4.0794 1.0074 1.0090 1.0071 1.0086 1.0158 1.0034 1.0178 1.0100 1.0245 1.0134 1.0252 1.0171 1.0141 1.0133 1.0074 1.0056 1.0060 1.0013 1.0008 1.0057 0.9942 0.9900 1.0014
dispcorr: -0.028707622 hartree
energy: -1805.234699940327
dipole: -29.54873 27.80731 -1.74142 -44.31109 42.39345 -1.91764 -42.63312 39.78682 -2.84630
magnitude: 3.84855 au
magnitude: 9.78222 debye
