program: Orca
programVersion: 5.0.2
elementType: Cl F O O O O O N C C C C C C C C C C C C C C C C C C C C C H H H H H H H H H H H H H H H H H H H H H H H
charge: 0
multiplicity: 1
keywords: wb97x-d3
keywords: def2-TZVPP
keywords: def2/J RIJCOSX
keywords: DEFGRID2
keywords: scfconv7
keywords: smallprint printgap noloewdin
keywords: NOSOSCF
formula: C21H23ClFNO5
InChI: InChI=1/C21H23ClFNO5/c1-2-3-6-9-28-19(25)12-29-18-11-17(16(23)10-15(18)22)24-20(26)13-7-4-5-8-14(13)21(24)27/h10-11H,2-9,12H2,1H3
52 atoms
Cl 3.835638 2.800427 2.629198
F  -1.192653 2.705571 2.513286
O  -2.347588 2.94356 -0.176779
O  -0.859933 -1.291411 0.554157
O  3.545203 0.966091 0.44194
O  2.586402 -2.163322 -0.888441
O  2.945633 -1.589207 1.246467
N  -1.279062 0.969491 0.35616
C  -5.340959 -0.095344 -1.759486
C  -5.162871 -1.349431 -0.904595
C  -4.712837 1.139002 -1.11028
C  -3.687983 -1.692582 -0.69031
C  -3.386118 0.786446 -0.55127
C  -2.936948 -0.456034 -0.368277
C  -2.336968 1.741121 -0.11816
C  -1.582779 -0.385997 0.224489
C  -0.069356 1.452943 0.874628
C  1.130962 1.020821 0.32662
C  -0.043685 2.31069 1.958823
C  2.344437 1.397763 0.879984
C  0.289129 -3.28586 -2.379723
C  1.1505 2.755212 2.488455
C  1.437505 -4.070193 -1.756945
C  2.337538 2.289577 1.95396
C  -0.287476 -3.977233 -3.607233
C  2.02474 -3.438848 -0.517073
C  -1.411403 -3.184504 -4.254995
C  3.558647 -0.068577 -0.512781
C  2.99153 -1.352837 0.065134
H  -4.883123 -0.258186 -2.738912
H  -6.401402 0.087934 -1.935382
H  -5.639437 -1.196449 0.067584
H  -5.668777 -2.194389 -1.372527
H  -4.620394 1.95559 -1.829671
H  -5.347996 1.518997 -0.303595
H  -3.569137 -2.430022 0.106541
H  -3.259362 -2.147951 -1.589955
H  1.083058 0.382035 -0.544165
H  0.626185 -2.284105 -2.662411
H  -0.502448 -3.145843 -1.635942
H  2.2269 -4.235811 -2.496167
H  1.084001 -5.062241 -1.461939
H  1.150581 3.434142 3.330799
H  0.510666 -4.139439 -4.337948
H  -0.651152 -4.970631 -3.328366
H  1.25731 -3.291823 0.245171
H  2.813154 -4.064365 -0.094214
H  -2.233055 -3.015103 -3.555489
H  -1.061578 -2.206947 -4.592307
H  -1.820001 -3.704457 -5.122412
H  4.607948 -0.239699 -0.762673
H  3.049785 0.211962 -1.43868
elementType: Cl F O N C H
totalener: -1805.20604243 hartree
nucrepener: 3060.69599421 hartree
electener: -4865.90203664 hartree
oneelecener: -8559.94745699 hartree
twoeener: 3694.04542035 hartree
cpcmener: -0.04868861 hartree
kineticenergy: 1798.96196616 hartree
xcener: -147.731656193291 hartree
chargesum: 0.0000000
charge: -0.071695 -0.209911 -0.425225 -0.436137 -0.318046 -0.273180 -0.464587 -0.055208 -0.137928 -0.133092 -0.070138 -0.073589 -0.093932 -0.036106 0.355407 0.334018 0.001221 -0.186183 0.187937 0.286941 -0.091368 -0.109508 -0.107002 -0.021848 -0.083383 -0.022414 -0.276963 0.045963 0.378460 0.078800 0.081355 0.079686 0.080680 0.093938 0.103055 0.098069 0.094517 0.146839 0.065075 0.035355 0.071773 0.071186 0.135907 0.056744 0.057857 0.103604 0.129570 0.074347 0.078642 0.094117 0.143925 0.132451
qa: -0.0717 -0.2099 -0.4252 -0.4361 -0.3180 -0.2732 -0.4646 -0.0552 -0.1379 -0.1331 -0.0701 -0.0736 -0.0939 -0.0361 0.3554 0.3340 0.0012 -0.1862 0.1879 0.2869 -0.0914 -0.1095 -0.1070 -0.0218 -0.0834 -0.0224 -0.2770 0.0460 0.3785 0.0788 0.0814 0.0797 0.0807 0.0939 0.1031 0.0981 0.0945 0.1468 0.0651 0.0354 0.0718 0.0712 0.1359 0.0567 0.0579 0.1036 0.1296 0.0743 0.0786 0.0941 0.1439 0.1325
va: 1.2392 1.0848 2.0901 2.0649 2.0976 2.1426 2.0324 3.0929 3.9247 3.9213 3.9154 3.9143 3.7323 3.7130 4.1638 4.1140 3.7000 3.9007 4.1168 3.8697 3.8576 3.9746 3.9326 3.9138 3.8859 3.8559 3.9446 3.8804 4.0791 1.0065 1.0090 1.0068 1.0087 1.0157 1.0032 1.0170 1.0059 1.0246 1.0146 1.0245 1.0164 1.0144 1.0132 1.0075 1.0057 1.0053 1.0018 0.9970 1.0010 1.0055 0.9902 1.0009
dispcorr: -0.028320926 hartree
energy: -1805.234363353813
dipole: -29.40685 27.61690 -1.78995 -44.88249 42.93778 -1.94471 -41.95971 39.19121 -2.76850
magnitude: 3.82759 au
magnitude: 9.72895 debye
