program: Orca
programVersion: 5.0.2
elementType: Cl F O O O O O N C C C C C C C C C C C C C C C C C C C C C H H H H H H H H H H H H H H H H H H H H H H H
charge: 0
multiplicity: 1
keywords: wb97x-d3
keywords: def2-TZVPP
keywords: def2/J RIJCOSX
keywords: DEFGRID2
keywords: scfconv7
keywords: smallprint printgap noloewdin
keywords: NOSOSCF
formula: C21H23ClFNO5
InChI: InChI=1/C21H23ClFNO5/c1-2-3-6-9-28-19(25)12-29-18-11-17(16(23)10-15(18)22)24-20(26)13-7-4-5-8-14(13)21(24)27/h10-11H,2-9,12H2,1H3
52 atoms
Cl 3.923887 2.951128 2.324523
F  -1.094432 3.083146 1.954841
O  -2.021624 2.760073 -0.960514
O  -1.033354 -1.145665 1.144086
O  3.62652 0.757096 0.507899
O  2.544811 -2.428483 -0.555727
O  2.836869 -1.675236 1.534527
N  -1.188566 0.9534 0.203453
C  -5.15973 -0.409595 -1.896033
C  -5.19313 -1.336375 -0.681112
C  -4.468232 0.920074 -1.588673
C  -3.787741 -1.699883 -0.201439
C  -3.237245 0.666285 -0.802398
C  -2.937269 -0.486097 -0.201422
C  -2.130894 1.627357 -0.566783
C  -1.628067 -0.340563 0.473758
C  0.027316 1.475655 0.668924
C  1.22042 0.887728 0.272335
C  0.055362 2.529616 1.561329
C  2.431502 1.312403 0.796965
C  0.064152 -3.113507 -1.959169
C  1.249369 3.009212 2.059895
C  1.033837 -4.108487 -1.3295
C  2.428202 2.391873 1.683478
C  -0.732937 -3.71583 -3.109045
C  1.771152 -3.567644 -0.125824
C  -1.656512 -2.706222 -3.772737
C  3.638162 -0.376815 -0.326843
C  2.961862 -1.561316 0.341194
H  -4.631248 -0.907662 -2.714027
H  -6.174239 -0.218507 -2.247328
H  -5.735815 -0.848579 0.133193
H  -5.741996 -2.247179 -0.921994
H  -4.228598 1.457481 -2.508852
H  -5.129193 1.579237 -1.01716
H  -3.815251 -2.145243 0.79549
H  -3.33478 -2.45178 -0.856754
H  1.161909 0.089483 -0.455204
H  0.60956 -2.239055 -2.326099
H  -0.627191 -2.743951 -1.194446
H  1.747852 -4.466195 -2.076807
H  0.484419 -4.989427 -0.985802
H  1.255586 3.840963 2.751696
H  -0.04284 -4.122977 -3.854062
H  -1.31793 -4.563889 -2.741542
H  1.065592 -3.257923 0.647328
H  2.443892 -4.313876 0.300331
H  -2.379024 -2.29771 -3.062017
H  -1.091992 -1.866986 -4.183769
H  -2.220188 -3.156046 -4.591031
H  4.688646 -0.625243 -0.491188
H  3.195561 -0.171344 -1.305123
elementType: Cl F O N C H
totalener: -1805.20556917 hartree
nucrepener: 3092.29637746 hartree
electener: -4897.50194663 hartree
oneelecener: -8622.74459385 hartree
twoeener: 3725.24264722 hartree
cpcmener: -0.04977605 hartree
kineticenergy: 1798.95528777 hartree
xcener: -147.730022060083 hartree
chargesum: -0.0000000
charge: -0.070537 -0.210396 -0.426505 -0.431849 -0.316165 -0.274735 -0.462680 -0.049748 -0.150033 -0.120455 -0.063488 -0.094434 -0.075387 -0.064453 0.355485 0.324926 -0.024987 -0.173265 0.194166 0.300953 -0.072586 -0.113765 -0.108864 -0.021822 -0.108212 -0.016830 -0.244747 0.044928 0.378162 0.081105 0.084963 0.080062 0.080449 0.093397 0.102567 0.102269 0.110298 0.143159 0.065714 0.021297 0.073674 0.071283 0.135862 0.061239 0.062492 0.101262 0.129206 0.044854 0.082374 0.093290 0.143783 0.132721
qa: -0.0705 -0.2104 -0.4265 -0.4318 -0.3162 -0.2747 -0.4627 -0.0497 -0.1500 -0.1205 -0.0635 -0.0944 -0.0754 -0.0645 0.3555 0.3249 -0.0250 -0.1733 0.1942 0.3010 -0.0726 -0.1138 -0.1089 -0.0218 -0.1082 -0.0168 -0.2447 0.0449 0.3782 0.0811 0.0850 0.0801 0.0804 0.0934 0.1026 0.1023 0.1103 0.1432 0.0657 0.0213 0.0737 0.0713 0.1359 0.0612 0.0625 0.1013 0.1292 0.0449 0.0824 0.0933 0.1438 0.1327
va: 1.2403 1.0848 2.0894 2.0679 2.1007 2.1410 2.0349 3.0608 3.9201 3.9060 3.9071 3.9193 3.7135 3.6935 4.1626 4.1145 3.6980 3.9211 4.1290 3.8690 3.8522 3.9774 3.9268 3.9092 3.9050 3.8567 3.9426 3.8727 4.0812 1.0062 1.0106 1.0072 1.0106 1.0161 1.0033 1.0180 0.9982 1.0246 1.0158 1.0307 1.0159 1.0144 1.0136 1.0080 1.0038 1.0072 1.0008 1.0025 1.0027 1.0066 0.9895 1.0027
dispcorr: -0.029934226 hartree
energy: -1805.235503391592
dipole: -32.05825 30.26748 -1.79077 -45.19745 43.03291 -2.16454 -36.29865 33.74522 -2.55343
magnitude: 3.79633 au
magnitude: 9.64949 debye
