program: Orca
programVersion: 5.0.2
elementType: Cl F O O O O O N C C C C C C C C C C C C C C C C C C C C C H H H H H H H H H H H H H H H H H H H H H H H
charge: 0
multiplicity: 1
keywords: wb97x-d3
keywords: def2-TZVPP
keywords: def2/J RIJCOSX
keywords: DEFGRID2
keywords: scfconv7
keywords: smallprint printgap noloewdin
keywords: NOSOSCF
formula: C21H23ClFNO5
InChI: InChI=1/C21H23ClFNO5/c1-2-3-6-9-28-19(25)12-29-18-11-17(16(23)10-15(18)22)24-20(26)13-7-4-5-8-14(13)21(24)27/h10-11H,2-9,12H2,1H3
52 atoms
Cl 4.263456 2.802994 1.173128
F  -0.508055 3.534652 -0.225903
O  -1.243577 1.257598 -1.953327
O  -1.915895 0.221739 2.421716
O  3.281804 0.208613 1.857973
O  2.899334 -1.676393 0.051326
O  2.170013 -3.173295 1.556288
N  -1.258681 0.947352 0.331858
C  -5.053004 -1.172558 -1.453455
C  -5.582333 -0.845976 -0.057859
C  -4.028695 -0.143167 -1.932506
C  -4.4697 -0.852567 0.99149
C  -3.092685 0.17162 -0.826682
C  -3.282731 -0.144087 0.45543
C  -1.787238 0.859232 -0.955098
C  -2.116501 0.328765 1.239192
C  0.037982 1.408522 0.608549
C  0.983099 0.555941 1.165988
C  0.404342 2.699766 0.277851
C  2.291723 0.973921 1.356566
C  0.377878 -2.821289 -2.532837
C  1.700752 3.139689 0.445521
C  0.951991 -2.041908 -1.356282
C  2.636347 2.274881 0.980026
C  -1.05345 -2.405447 -2.849024
C  2.388844 -2.431194 -1.067659
C  -1.667052 -3.199162 -3.990968
C  2.978835 -1.078862 2.33897
C  2.632997 -2.09584 1.270027
H  -4.58739 -2.162422 -1.442193
H  -5.878253 -1.221945 -2.164462
H  -6.056928 0.139046 -0.072087
H  -6.354184 -1.561813 0.226413
H  -3.480777 -0.513092 -2.802426
H  -4.525015 0.777219 -2.256016
H  -4.804422 -0.388259 1.921679
H  -4.186761 -1.878077 1.249379
H  0.662637 -0.443719 1.424235
H  0.407494 -3.893075 -2.312168
H  1.0042 -2.672528 -3.418325
H  0.331257 -2.218255 -0.472765
H  0.905981 -0.96987 -1.56823
H  1.972342 4.148466 0.164845
H  -1.669901 -2.519127 -1.951295
H  -1.071995 -1.340771 -3.096707
H  2.492497 -3.5014 -0.88407
H  3.03935 -2.168591 -1.900321
H  -1.691438 -4.266972 -3.766019
H  -2.691909 -2.88134 -4.188951
H  -1.099162 -3.070537 -4.914237
H  2.167165 -1.062897 3.073217
H  3.873906 -1.425803 2.858805
elementType: Cl F O N C H
totalener: -1805.20458485 hartree
nucrepener: 3122.51639120 hartree
electener: -4927.72097605 hartree
oneelecener: -8682.50641882 hartree
twoeener: 3754.78544277 hartree
cpcmener: -0.04370309 hartree
kineticenergy: 1798.94208263 hartree
xcener: -147.729581702027 hartree
chargesum: 0.0000000
charge: -0.072940 -0.209659 -0.429097 -0.425268 -0.317719 -0.275335 -0.476040 -0.011093 -0.132250 -0.134167 -0.084700 -0.071202 -0.068059 -0.050142 0.285052 0.335134 0.040368 -0.250555 0.171889 0.310783 -0.124021 -0.089904 -0.087286 -0.035448 -0.080205 0.007146 -0.284191 0.015636 0.390062 0.078272 0.083332 0.078034 0.080924 0.098101 0.114172 0.094994 0.102146 0.149940 0.067933 0.067922 0.077893 0.062218 0.134678 0.054125 0.050725 0.103965 0.120438 0.082676 0.088063 0.082767 0.135948 0.143944
qa: -0.0729 -0.2097 -0.4291 -0.4253 -0.3177 -0.2753 -0.4760 -0.0111 -0.1323 -0.1342 -0.0847 -0.0712 -0.0681 -0.0501 0.2851 0.3351 0.0404 -0.2506 0.1719 0.3108 -0.1240 -0.0899 -0.0873 -0.0354 -0.0802 0.0071 -0.2842 0.0156 0.3901 0.0783 0.0833 0.0780 0.0809 0.0981 0.1142 0.0950 0.1021 0.1499 0.0679 0.0679 0.0779 0.0622 0.1347 0.0541 0.0507 0.1040 0.1204 0.0827 0.0881 0.0828 0.1359 0.1439
va: 1.2375 1.0856 2.0646 2.0849 2.0939 2.1564 2.0267 3.0528 3.9080 3.9199 3.9144 3.9109 3.6980 3.6825 4.1318 4.1559 3.6286 3.9308 4.1306 3.9105 3.9334 3.9614 3.8187 3.8969 3.8655 3.8386 3.9566 3.8861 4.1021 1.0078 1.0096 1.0066 1.0094 1.0072 1.0050 1.0142 1.0053 1.0178 1.0094 1.0090 1.0181 1.0213 1.0137 1.0035 1.0154 1.0168 0.9990 1.0007 1.0034 1.0002 1.0023 0.9906
dispcorr: -0.031236326 hartree
energy: -1805.235821173730
dipole: -34.41372 32.63589 -1.77783 -40.55010 39.43455 -1.11555 -26.31949 25.44710 -0.87239
magnitude: 2.27293 au
magnitude: 5.77733 debye
