program: Orca
programVersion: 5.0.2
elementType: Cl F O O O O O N C C C C C C C C C C C C C C C C C C C C C H H H H H H H H H H H H H H H H H H H H H H H
charge: 0
multiplicity: 1
keywords: wb97x-d3
keywords: def2-TZVPP
keywords: def2/J RIJCOSX
keywords: DEFGRID2
keywords: scfconv7
keywords: smallprint printgap noloewdin
keywords: NOSOSCF
formula: C21H23ClFNO5
InChI: InChI=1/C21H23ClFNO5/c1-2-3-6-9-28-19(25)12-29-18-11-17(16(23)10-15(18)22)24-20(26)13-7-4-5-8-14(13)21(24)27/h10-11H,2-9,12H2,1H3
52 atoms
Cl 4.005105 1.252251 3.108973
F  -0.936655 0.368845 3.389953
O  -1.637417 -1.546865 1.167768
O  -1.641763 2.772722 -0.248197
O  3.414447 1.586437 0.33177
O  3.045944 -0.583177 -1.126715
O  2.64408 0.576535 -3.005893
N  -1.326204 0.683794 0.678013
C  -5.034981 -0.817715 -1.775359
C  -5.441407 0.643058 -1.584842
C  -4.203251 -1.334551 -0.600692
C  -4.22407 1.566209 -1.512054
C  -3.188913 -0.317334 -0.232774
C  -3.190934 0.951509 -0.644555
C  -1.998139 -0.535159 0.622292
C  -1.996588 1.632722 -0.09099
C  -0.064319 0.862095 1.266405
C  1.029004 1.193172 0.476044
C  0.113381 0.676416 2.624267
C  2.29432 1.312629 1.029426
C  0.519623 -3.223047 -2.115703
C  1.359608 0.795763 3.203898
C  1.048363 -1.931776 -1.503293
C  2.441386 1.113323 2.404774
C  -0.983509 -3.389558 -1.932114
C  2.54872 -1.812522 -1.691367
C  -1.519719 -4.651816 -2.589138
C  3.320689 1.766723 -1.060917
C  2.958759 0.518575 -1.84232
H  -5.920756 -1.44158 -1.897607
H  -4.452328 -0.913589 -2.695701
H  -6.092003 0.961301 -2.399699
H  -6.021141 0.740241 -0.662855
H  -4.839848 -1.538897 0.265866
H  -3.718325 -2.281408 -0.850871
H  -3.80319 1.733213 -2.50866
H  -4.501048 2.55225 -1.13234
H  0.856829 1.336357 -0.582016
H  1.036095 -4.080704 -1.672648
H  0.757054 -3.241575 -3.184325
H  0.813726 -1.901337 -0.435867
H  0.540573 -1.080088 -1.965054
H  1.480567 0.643897 4.268093
H  -1.219139 -3.407534 -0.865046
H  -1.497783 -2.5148 -2.34296
H  3.07114 -2.598778 -1.1487
H  2.83002 -1.886081 -2.742953
H  -1.326749 -4.653169 -3.66351
H  -1.052189 -5.544875 -2.17025
H  -2.597151 -4.748075 -2.448482
H  4.308044 2.095621 -1.389981
H  2.613985 2.558114 -1.327024
elementType: Cl F O N C H
totalener: -1805.20490046 hartree
nucrepener: 3112.93959650 hartree
electener: -4918.14449696 hartree
oneelecener: -8663.55716152 hartree
twoeener: 3745.41266456 hartree
cpcmener: -0.04328567 hartree
kineticenergy: 1798.95107714 hartree
xcener: -147.730918633090 hartree
chargesum: -0.0000000
charge: -0.071579 -0.209714 -0.430041 -0.425629 -0.317578 -0.274699 -0.475182 -0.011695 -0.128117 -0.136371 -0.086773 -0.075534 -0.037500 -0.065312 0.281210 0.339609 0.022466 -0.248437 0.185346 0.309597 -0.115763 -0.098948 -0.096454 -0.024298 -0.091455 0.011251 -0.283041 0.018114 0.390805 0.081898 0.078535 0.081485 0.078518 0.109902 0.096536 0.102937 0.095338 0.148700 0.067708 0.067066 0.059935 0.078431 0.134879 0.053524 0.057396 0.120044 0.102652 0.080847 0.080815 0.090272 0.143577 0.134728
qa: -0.0716 -0.2097 -0.4300 -0.4256 -0.3176 -0.2747 -0.4752 -0.0117 -0.1281 -0.1364 -0.0868 -0.0755 -0.0375 -0.0653 0.2812 0.3396 0.0225 -0.2484 0.1853 0.3096 -0.1158 -0.0989 -0.0965 -0.0243 -0.0915 0.0113 -0.2830 0.0181 0.3908 0.0819 0.0785 0.0815 0.0785 0.1099 0.0965 0.1029 0.0953 0.1487 0.0677 0.0671 0.0599 0.0784 0.1349 0.0535 0.0574 0.1200 0.1027 0.0808 0.0808 0.0903 0.1436 0.1347
va: 1.2391 1.0860 2.0642 2.0861 2.0979 2.1577 2.0267 3.0439 3.9087 3.9191 3.9223 3.9146 3.6961 3.7105 4.1470 4.1522 3.6216 3.9211 4.1318 3.8877 3.9162 3.9695 3.8262 3.8989 3.8717 3.8393 3.9605 3.8869 4.0958 1.0094 1.0089 1.0094 1.0064 1.0056 1.0084 1.0046 1.0140 1.0201 1.0089 1.0087 1.0250 1.0182 1.0140 1.0143 1.0016 0.9994 1.0167 1.0007 0.9998 1.0029 0.9904 1.0016
dispcorr: -0.030468156 hartree
energy: -1805.235368617953
dipole: -31.34765 29.70570 -1.64196 -30.14183 29.39021 -0.75163 -39.44991 38.23071 -1.21920
magnitude: 2.17886 au
magnitude: 5.53822 debye
