program: Orca
programVersion: 5.0.2
elementType: Cl F O O O O O N C C C C C C C C C C C C C C C C C C C C C H H H H H H H H H H H H H H H H H H H H H H H
charge: 0
multiplicity: 1
keywords: wb97x-d3
keywords: def2-TZVPP
keywords: def2/J RIJCOSX
keywords: DEFGRID2
keywords: scfconv7
keywords: smallprint printgap noloewdin
keywords: NOSOSCF
formula: C21H23ClFNO5
InChI: InChI=1/C21H23ClFNO5/c1-2-3-6-9-28-19(25)12-29-18-11-17(16(23)10-15(18)22)24-20(26)13-7-4-5-8-14(13)21(24)27/h10-11H,2-9,12H2,1H3
52 atoms
Cl 4.179304 2.888185 0.996946
F  -0.598517 3.425109 -0.46709
O  -1.317114 1.109968 -2.18091
O  -1.908628 0.237869 2.241987
O  3.310291 0.247001 1.617512
O  3.039181 -1.531478 -0.298296
O  2.849192 -3.26518 1.118451
N  -1.265608 0.834284 0.108147
C  -5.314025 -0.949559 -1.475854
C  -5.75366 -0.53198 -0.073727
C  -4.206221 -0.047841 -2.023948
C  -4.607796 -0.621846 0.935502
C  -3.210277 0.21815 -0.958804
C  -3.38135 -0.042564 0.337834
C  -1.852307 0.778393 -1.153673
C  -2.144357 0.331041 1.06464
C  0.027216 1.319873 0.358026
C  1.002268 0.49688 0.906721
C  0.34587 2.626708 0.037007
C  2.290979 0.968458 1.112578
C  0.325509 -2.855145 -1.011989
C  1.619017 3.120475 0.223114
C  1.351875 -2.205197 -1.931767
C  2.582657 2.289017 0.761162
C  -1.080454 -2.828417 -1.597082
C  2.794584 -2.317965 -1.483545
C  -2.124692 -3.351467 -0.624402
C  3.10106 -1.084633 2.020571
C  2.980121 -2.086492 0.890835
H  -4.95471 -1.982021 -1.448545
H  -6.166244 -0.932632 -2.155912
H  -6.126749 0.495464 -0.101513
H  -6.581892 -1.157965 0.259912
H  -3.720605 -0.507124 -2.888247
H  -4.617678 0.902675 -2.377724
H  -4.861489 -0.105863 1.864155
H  -4.412811 -1.663753 1.210332
H  0.725248 -0.519281 1.15118
H  0.30611 -2.34493 -0.04451
H  0.612934 -3.891515 -0.808708
H  1.098331 -1.151431 -2.086341
H  1.30501 -2.677053 -2.917993
H  1.85059 4.143406 -0.041642
H  -1.333129 -1.806327 -1.891657
H  -1.103368 -3.418074 -2.518203
H  3.085538 -3.355944 -1.31942
H  3.459584 -1.896903 -2.235629
H  -3.125867 -3.33014 -1.056973
H  -1.914679 -4.383145 -0.335325
H  -2.147431 -2.753413 0.28941
H  2.227344 -1.191076 2.672113
H  3.972459 -1.35857 2.617307
elementType: Cl F O N C H
totalener: -1805.20506665 hartree
nucrepener: 3158.71096087 hartree
electener: -4963.91602752 hartree
oneelecener: -8754.88162728 hartree
twoeener: 3790.96559976 hartree
cpcmener: -0.04547348 hartree
kineticenergy: 1798.95379347 hartree
xcener: -147.734174987507 hartree
chargesum: 0.0000000
charge: -0.073040 -0.210981 -0.429738 -0.426720 -0.318409 -0.265629 -0.480223 -0.001719 -0.156752 -0.125715 -0.070599 -0.072896 -0.039150 -0.112303 0.279200 0.351406 0.022318 -0.237784 0.187496 0.296324 -0.137694 -0.106195 -0.093491 -0.027838 -0.097312 -0.011151 -0.314760 0.024442 0.394908 0.087420 0.085805 0.078338 0.081040 0.097448 0.108912 0.099417 0.104269 0.163104 0.056424 0.085242 0.066433 0.087406 0.134453 0.050177 0.082535 0.106016 0.119896 0.103035 0.101213 0.078049 0.133642 0.143727
qa: -0.0730 -0.2110 -0.4297 -0.4267 -0.3184 -0.2656 -0.4802 -0.0017 -0.1568 -0.1257 -0.0706 -0.0729 -0.0392 -0.1123 0.2792 0.3514 0.0223 -0.2378 0.1875 0.2963 -0.1377 -0.1062 -0.0935 -0.0278 -0.0973 -0.0112 -0.3148 0.0244 0.3949 0.0874 0.0858 0.0783 0.0810 0.0974 0.1089 0.0994 0.1043 0.1631 0.0564 0.0852 0.0664 0.0874 0.1345 0.0502 0.0825 0.1060 0.1199 0.1030 0.1012 0.0780 0.1336 0.1437
va: 1.2381 1.0836 2.0649 2.0832 2.0957 2.1493 2.0228 3.0304 3.9162 3.9050 3.8996 3.9114 3.6369 3.6649 4.1326 4.1290 3.6307 3.9280 4.1250 3.9141 3.8640 3.9856 3.8266 3.8926 3.8632 3.8621 3.9472 3.8974 4.1048 1.0080 1.0120 1.0074 1.0104 1.0126 1.0036 1.0161 1.0032 1.0046 1.0067 1.0174 1.0237 1.0153 1.0147 1.0120 1.0081 1.0157 0.9999 1.0025 1.0049 0.9976 0.9992 0.9934
dispcorr: -0.033582903 hartree
energy: -1805.238649555685
dipole: -35.33460 33.35845 -1.97615 -40.34294 39.39161 -0.95133 -14.58620 13.76686 -0.81934
magnitude: 2.34126 au
magnitude: 5.95102 debye
