program: Orca
programVersion: 5.0.2
elementType: Cl F O O O O O N C C C C C C C C C C C C C C C C C C C C C H H H H H H H H H H H H H H H H H H H H H H H
charge: 0
multiplicity: 1
keywords: wb97x-d3
keywords: def2-TZVPP
keywords: def2/J RIJCOSX
keywords: DEFGRID2
keywords: scfconv7
keywords: smallprint printgap noloewdin
keywords: NOSOSCF
formula: C21H23ClFNO5
InChI: InChI=1/C21H23ClFNO5/c1-2-3-6-9-28-19(25)12-29-18-11-17(16(23)10-15(18)22)24-20(26)13-7-4-5-8-14(13)21(24)27/h10-11H,2-9,12H2,1H3
52 atoms
Cl 4.340484 2.887584 0.600628
F  -0.654452 3.447019 0.758767
O  -1.187047 0.949937 -2.817871
O  -1.757124 0.769873 1.687337
O  3.659098 0.498988 -0.805703
O  2.824841 -1.654954 0.472983
O  2.602422 -2.861471 -1.406828
N  -1.14152 1.058408 -0.515084
C  -5.353804 -0.590649 -1.781353
C  -5.183211 -1.318848 -0.449432
C  -4.011285 -0.331352 -2.46687
C  -4.375215 -0.487814 0.54782
C  -3.02834 0.142442 -1.463136
C  -3.193939 0.085862 -0.140494
C  -1.70595 0.749127 -1.750023
C  -1.994685 0.660916 0.511302
C  0.166002 1.525803 -0.308459
C  1.251589 0.774727 -0.73998
C  0.387794 2.710214 0.367584
C  2.548366 1.182414 -0.46679
C  -0.210635 -3.301462 2.023522
C  1.666462 3.142263 0.652048
C  0.592197 -2.28314 1.223902
C  2.737916 2.375104 0.236203
C  -1.697632 -2.972972 2.063036
C  2.074665 -2.600839 1.261649
C  -2.505351 -4.010172 2.826941
C  3.53431 -0.68069 -1.562799
C  2.929129 -1.856427 -0.822985
H  -5.995825 -1.168902 -2.446398
H  -5.859242 0.363258 -1.607879
H  -6.157772 -1.556078 -0.022463
H  -4.67223 -2.270845 -0.618682
H  -3.632223 -1.243459 -2.937992
H  -4.116746 0.401356 -3.269997
H  -4.983627 0.32337 0.959789
H  -4.060548 -1.09431 1.40048
H  1.041877 -0.140461 -1.276589
H  0.174414 -3.356173 3.047058
H  -0.068913 -4.296417 1.589896
H  0.427496 -1.280562 1.62805
H  0.23387 -2.272909 0.190313
H  1.820142 4.068278 1.189518
H  -1.839246 -1.990745 2.521573
H  -2.078643 -2.888809 1.039947
H  2.467852 -2.493462 2.271306
H  2.279181 -3.618626 0.927024
H  -2.169411 -4.089152 3.862527
H  -3.566284 -3.757229 2.844261
H  -2.410283 -4.99919 2.375241
H  4.548203 -0.958559 -1.856202
H  2.965631 -0.520218 -2.483881
elementType: Cl F O N C H
totalener: -1805.20487753 hartree
nucrepener: 3111.92088204 hartree
electener: -4917.12575957 hartree
oneelecener: -8661.41642925 hartree
twoeener: 3744.29066968 hartree
cpcmener: -0.04372099 hartree
kineticenergy: 1798.95688510 hartree
xcener: -147.731714534719 hartree
chargesum: 0.0000000
charge: -0.071827 -0.209766 -0.425453 -0.430522 -0.318447 -0.274484 -0.477453 -0.014277 -0.135818 -0.126980 -0.073232 -0.093909 -0.062582 -0.043234 0.339431 0.282050 0.026833 -0.250428 0.179750 0.313698 -0.119683 -0.093624 -0.092152 -0.029600 -0.087405 0.009044 -0.283047 0.016691 0.392742 0.080969 0.078463 0.082638 0.078032 0.102513 0.096057 0.112466 0.098108 0.150553 0.067765 0.068159 0.060094 0.078782 0.135518 0.052284 0.056346 0.120495 0.102902 0.081332 0.089816 0.081187 0.143657 0.135543
qa: -0.0718 -0.2098 -0.4255 -0.4305 -0.3184 -0.2745 -0.4775 -0.0143 -0.1358 -0.1270 -0.0732 -0.0939 -0.0626 -0.0432 0.3394 0.2821 0.0268 -0.2504 0.1798 0.3137 -0.1197 -0.0936 -0.0922 -0.0296 -0.0874 0.0090 -0.2830 0.0167 0.3927 0.0810 0.0785 0.0826 0.0780 0.1025 0.0961 0.1125 0.0981 0.1506 0.0678 0.0682 0.0601 0.0788 0.1355 0.0523 0.0563 0.1205 0.1029 0.0813 0.0898 0.0812 0.1437 0.1355
va: 1.2387 1.0858 2.0859 2.0638 2.0946 2.1584 2.0256 3.0429 3.9193 3.9060 3.9130 3.9233 3.7075 3.6947 4.1535 4.1394 3.6214 3.9367 4.1373 3.8945 3.9224 3.9644 3.8243 3.8976 3.8700 3.8387 3.9589 3.8890 4.0974 1.0094 1.0065 1.0096 1.0091 1.0051 1.0136 1.0057 1.0071 1.0179 1.0087 1.0087 1.0244 1.0177 1.0137 1.0138 1.0024 0.9990 1.0171 1.0001 1.0032 1.0007 0.9906 1.0020
dispcorr: -0.030593243 hartree
energy: -1805.235470768705
dipole: -38.72778 36.85503 -1.87275 -44.52758 43.32294 -1.20464 7.69371 -7.63889 0.05482
magnitude: 2.22741 au
magnitude: 5.66163 debye
