program: Orca
programVersion: 5.0.2
elementType: Cl F O O O O O N C C C C C C C C C C C C C C C C C C C C C H H H H H H H H H H H H H H H H H H H H H H H
charge: 0
multiplicity: 1
keywords: wb97x-d3
keywords: def2-TZVPP
keywords: def2/J RIJCOSX
keywords: DEFGRID2
keywords: scfconv7
keywords: smallprint printgap noloewdin
keywords: NOSOSCF
formula: C21H23ClFNO5
InChI: InChI=1/C21H23ClFNO5/c1-2-3-6-9-28-19(25)12-29-18-11-17(16(23)10-15(18)22)24-20(26)13-7-4-5-8-14(13)21(24)27/h10-11H,2-9,12H2,1H3
52 atoms
Cl 4.068093 3.116147 1.362504
F  -0.935572 3.523709 1.111134
O  -0.950885 0.719497 -2.399456
O  -2.191434 0.994687 1.964952
O  3.571048 0.658006 -0.008046
O  2.783409 -2.703126 -0.832738
O  2.833062 -1.685154 1.174517
N  -1.253065 1.084508 -0.139645
C  -5.241785 -0.707179 -1.871486
C  -5.311431 -1.253527 -0.445988
C  -3.798818 -0.535273 -2.348018
C  -4.655222 -0.306197 0.560058
C  -2.98988 0.073686 -1.265486
C  -3.366211 0.177812 0.009634
C  -1.627796 0.639384 -1.406513
C  -2.260273 0.794726 0.77978
C  0.016434 1.57638 0.201659
C  1.154944 0.834704 -0.09167
C  0.150941 2.794505 0.842392
C  2.415235 1.302031 0.249655
C  -0.16901 -3.064464 -1.0966
C  1.390121 3.272951 1.214303
C  0.898084 -4.153287 -1.196056
C  2.514301 2.528174 0.912519
C  -0.706556 -2.79931 0.30725
C  2.142071 -3.908495 -0.36816
C  -1.337201 -4.018864 0.96198
C  3.538315 -0.506061 -0.795985
C  3.007512 -1.693015 -0.017969
H  -5.772696 -1.372119 -2.553238
H  -5.751553 0.259009 -1.913853
H  -6.349557 -1.426077 -0.161393
H  -4.80821 -2.223508 -0.40517
H  -3.359703 -1.502825 -2.613181
H  -3.75271 0.075123 -3.252469
H  -5.303764 0.550945 0.765469
H  -4.495832 -0.802764 1.51962
H  1.020776 -0.115556 -0.589924
H  -1.003473 -3.352059 -1.743391
H  0.218834 -2.131694 -1.516852
H  1.181458 -4.287886 -2.243065
H  0.49238 -5.114936 -0.871357
H  1.473868 4.225526 1.72005
H  0.083248 -2.404113 0.951967
H  -1.456279 -2.007114 0.240473
H  1.914222 -3.836379 0.694587
H  2.861069 -4.716762 -0.502789
H  -1.785964 -3.762136 1.922316
H  -2.12511 -4.439786 0.333635
H  -0.607882 -4.808989 1.14744
H  4.571927 -0.710626 -1.082836
H  2.968474 -0.364063 -1.719006
elementType: Cl F O N C H
totalener: -1805.20407489 hartree
nucrepener: 3125.75288892 hartree
electener: -4930.95696381 hartree
oneelecener: -8689.45050640 hartree
twoeener: 3758.49354259 hartree
cpcmener: -0.04844407 hartree
kineticenergy: 1798.93800521 hartree
xcener: -147.731948670905 hartree
chargesum: 0.0000000
charge: -0.072287 -0.209499 -0.423080 -0.424199 -0.314219 -0.287551 -0.458758 -0.034507 -0.135828 -0.135276 -0.067882 -0.082137 -0.052845 -0.068355 0.301388 0.342822 0.003426 -0.160055 0.192085 0.269013 -0.141683 -0.107988 -0.132067 -0.029342 -0.073728 0.002128 -0.290827 0.033471 0.386566 0.080986 0.078760 0.082384 0.077901 0.102195 0.096839 0.105191 0.092835 0.124161 0.087869 0.070614 0.086536 0.081065 0.135565 0.060963 0.037885 0.102202 0.121197 0.094963 0.084247 0.085278 0.144646 0.136934
qa: -0.0723 -0.2095 -0.4231 -0.4242 -0.3142 -0.2876 -0.4588 -0.0345 -0.1358 -0.1353 -0.0679 -0.0821 -0.0528 -0.0684 0.3014 0.3428 0.0034 -0.1601 0.1921 0.2690 -0.1417 -0.1080 -0.1321 -0.0293 -0.0737 0.0021 -0.2908 0.0335 0.3866 0.0810 0.0788 0.0824 0.0779 0.1022 0.0968 0.1052 0.0928 0.1242 0.0879 0.0706 0.0865 0.0811 0.1356 0.0610 0.0379 0.1022 0.1212 0.0950 0.0842 0.0853 0.1446 0.1369
va: 1.2385 1.0852 2.0803 2.0889 2.1004 2.1389 2.0419 3.0519 3.9188 3.9177 3.9110 3.9161 3.6627 3.6669 4.1503 4.1261 3.6963 3.9343 4.0984 3.9605 3.8667 3.9731 3.9113 3.8851 3.8480 3.8230 3.9594 3.8654 4.0979 1.0095 1.0064 1.0100 1.0079 1.0059 1.0148 1.0022 1.0164 1.0302 1.0080 1.0246 1.0153 1.0083 1.0136 1.0196 1.0320 1.0146 1.0017 1.0041 1.0007 0.9982 0.9932 1.0011
dispcorr: -0.031930336 hartree
energy: -1805.236005227384
dipole: -32.66633 30.81688 -1.84945 -49.37905 46.93371 -2.44534 -13.79125 11.56427 -2.22697
magnitude: 3.78940 au
magnitude: 9.63189 debye
