program: Orca
programVersion: 5.0.2
elementType: Cl F O O O O O N C C C C C C C C C C C C C C C C C C C C C H H H H H H H H H H H H H H H H H H H H H H H
charge: 0
multiplicity: 1
keywords: wb97x-d3
keywords: def2-TZVPP
keywords: def2/J RIJCOSX
keywords: DEFGRID2
keywords: scfconv7
keywords: smallprint printgap noloewdin
keywords: NOSOSCF
formula: C21H23ClFNO5
InChI: InChI=1/C21H23ClFNO5/c1-2-3-6-9-28-19(25)12-29-18-11-17(16(23)10-15(18)22)24-20(26)13-7-4-5-8-14(13)21(24)27/h10-11H,2-9,12H2,1H3
52 atoms
Cl 4.038586 2.91149 1.917688
F  -0.978286 3.185935 1.649391
O  -0.904424 1.131392 -2.257223
O  -2.112979 0.417847 2.066374
O  3.640143 0.678466 0.176616
O  2.594177 -2.57438 -0.727229
O  2.976349 -1.71827 1.312084
N  -1.191929 0.975597 0.027342
C  -4.895926 -1.037565 -2.039758
C  -5.561633 -0.560574 -0.749649
C  -3.752226 -0.117189 -2.468628
C  -4.583196 -0.546523 0.425957
C  -2.9290 0.225208 -1.284405
C  -3.290255 0.029708 -0.015444
C  -1.573228 0.823292 -1.304253
C  -2.185082 0.474349 0.865711
C  0.056447 1.446063 0.462996
C  1.222727 0.8020 0.071249
C  0.13999 2.550443 1.28987
C  2.461969 1.245818 0.507651
C  -0.394738 -2.842063 -0.943942
C  1.357557 3.007177 1.750877
C  0.470744 -3.398185 0.183167
C  2.51029 2.355081 1.355194
C  -0.624966 -3.806343 -2.100468
C  1.903311 -3.724025 -0.194563
C  -1.583308 -3.240714 -3.137774
C  3.61547 -0.470809 -0.636046
C  3.024205 -1.65237 0.109255
H  -4.504489 -2.048311 -1.891868
H  -5.632919 -1.100767 -2.84082
H  -5.957584 0.447484 -0.898701
H  -6.411651 -1.199294 -0.508233
H  -3.135187 -0.591506 -3.235092
H  -4.140232 0.802401 -2.917467
H  -4.986945 0.025113 1.264625
H  -4.414706 -1.559895 0.804056
H  1.12359 -0.055825 -0.579113
H  0.033395 -1.911871 -1.33121
H  -1.362876 -2.562533 -0.516619
H  0.03208 -4.329897 0.552744
H  0.459237 -2.707263 1.0289
H  1.403268 3.869194 2.402936
H  0.3251 -4.049928 -2.583799
H  -1.019948 -4.749723 -1.711519
H  2.45152 -4.127413 0.657985
H  1.947884 -4.460079 -0.995005
H  -1.211281 -2.300461 -3.549399
H  -1.726415 -3.929726 -3.970767
H  -2.565258 -3.044116 -2.702753
H  4.656196 -0.697567 -0.876811
H  3.093758 -0.296246 -1.580822
elementType: Cl F O N C H
totalener: -1805.20503671 hartree
nucrepener: 3127.02016602 hartree
electener: -4932.22520272 hartree
oneelecener: -8691.86184556 hartree
twoeener: 3759.63664284 hartree
cpcmener: -0.04870127 hartree
kineticenergy: 1798.95101058 hartree
xcener: -147.732414305786 hartree
chargesum: 0.0000000
charge: -0.071258 -0.209839 -0.424142 -0.427451 -0.316229 -0.284123 -0.460223 -0.035022 -0.142733 -0.134190 -0.108816 -0.067847 -0.057358 -0.082644 0.312949 0.354190 -0.005869 -0.157885 0.195878 0.264849 -0.124742 -0.109477 -0.140462 -0.028314 -0.073375 -0.011160 -0.295092 0.046416 0.370977 0.084579 0.083103 0.079420 0.081277 0.101245 0.114699 0.096882 0.102685 0.140123 0.058027 0.071950 0.087476 0.089365 0.135838 0.062143 0.059665 0.118974 0.124818 0.078657 0.099224 0.077319 0.143115 0.132407
qa: -0.0713 -0.2098 -0.4241 -0.4275 -0.3162 -0.2841 -0.4602 -0.0350 -0.1427 -0.1342 -0.1088 -0.0678 -0.0574 -0.0826 0.3129 0.3542 -0.0059 -0.1579 0.1959 0.2648 -0.1247 -0.1095 -0.1405 -0.0283 -0.0734 -0.0112 -0.2951 0.0464 0.3710 0.0846 0.0831 0.0794 0.0813 0.1012 0.1147 0.0969 0.1027 0.1401 0.0580 0.0719 0.0875 0.0894 0.1358 0.0621 0.0597 0.1190 0.1248 0.0787 0.0992 0.0773 0.1431 0.1324
va: 1.2395 1.0855 2.0798 2.0864 2.1028 2.1295 2.0340 3.0493 3.9099 3.9203 3.9251 3.9058 3.6227 3.6822 4.1333 4.1333 3.6932 3.9271 4.1087 3.9489 3.8824 3.9775 3.8609 3.8988 3.8692 3.8296 3.9559 3.8739 4.1062 1.0042 1.0109 1.0068 1.0093 1.0095 1.0049 1.0143 1.0058 1.0244 1.0181 1.0063 1.0155 1.0271 1.0136 1.0064 1.0065 1.0121 0.9933 1.0025 1.0076 0.9971 0.9897 1.0038
dispcorr: -0.031819934 hartree
energy: -1805.236856639319
dipole: -34.00872 32.04352 -1.96520 -45.05198 42.89015 -2.16183 -27.93223 25.59832 -2.33392
magnitude: 3.73934 au
magnitude: 9.50465 debye
