program: Orca
programVersion: 5.0.2
elementType: Cl F O O O O O N C C C C C C C C C C C C C C C C C C C C C H H H H H H H H H H H H H H H H H H H H H H H
charge: 0
multiplicity: 1
keywords: wb97x-d3
keywords: def2-TZVPP
keywords: def2/J RIJCOSX
keywords: DEFGRID2
keywords: scfconv7
keywords: smallprint printgap noloewdin
keywords: NOSOSCF
formula: C21H23ClFNO5
InChI: InChI=1/C21H23ClFNO5/c1-2-3-6-9-28-19(25)12-29-18-11-17(16(23)10-15(18)22)24-20(26)13-7-4-5-8-14(13)21(24)27/h10-11H,2-9,12H2,1H3
52 atoms
Cl 3.954255 3.174382 1.488495
F  -0.881271 3.650705 0.202178
O  -1.55323 1.690111 -2.003379
O  -1.785658 -0.13689 2.151311
O  3.316332 0.394628 1.439556
O  3.041638 -2.876046 0.06725
O  3.349578 -0.896858 -0.947182
N  -1.33209 0.947434 0.167161
C  -5.308909 -0.840209 -1.569115
C  -5.695965 -0.77681 -0.092284
C  -4.335538 0.275129 -1.955819
C  -4.482867 -0.951738 0.821841
C  -3.293163 0.405055 -0.909155
C  -3.357205 -0.136691 0.307524
C  -1.994769 1.106564 -1.046674
C  -2.106349 0.181127 1.034934
C  -0.064539 1.467603 0.469898
C  0.991964 0.618356 0.775776
C  0.138484 2.835066 0.482248
C  2.239509 1.131713 1.101916
C  0.484745 -4.178499 -0.89115
C  1.372346 3.372564 0.780337
C  1.541095 -3.505671 -1.760282
C  2.412177 2.518691 1.095318
C  -0.93234 -4.027259 -1.43681
C  2.940342 -3.583297 -1.186659
C  -1.486656 -2.616915 -1.29166
C  3.215435 -1.007323 1.449175
C  3.205742 -1.568293 0.043124
H  -4.84475 -1.808243 -1.778746
H  -6.201023 -0.77829 -2.19296
H  -6.167575 0.187021 0.117866
H  -6.4366 -1.544395 0.134329
H  -3.876039 0.073868 -2.926029
H  -4.860973 1.229358 -2.062109
H  -4.721227 -0.671983 1.850297
H  -4.172271 -2.001435 0.857315
H  0.806052 -0.44709 0.749693
H  0.513634 -3.774357 0.125452
H  0.730921 -5.240773 -0.804055
H  1.280395 -2.463829 -1.961465
H  1.574146 -4.000922 -2.735267
H  1.513534 4.44497 0.780498
H  -0.956733 -4.333058 -2.487207
H  -1.59126 -4.718541 -0.905708
H  3.203412 -4.611749 -0.94185
H  3.684031 -3.205136 -1.888877
H  -2.518672 -2.555955 -1.641083
H  -1.474913 -2.311408 -0.243207
H  -0.909923 -1.881223 -1.855105
H  2.347291 -1.362627 2.012955
H  4.103686 -1.373405 1.967783
elementType: Cl F O N C H
totalener: -1805.20590241 hartree
nucrepener: 3090.45184903 hartree
electener: -4895.65775144 hartree
oneelecener: -8619.14447689 hartree
twoeener: 3723.48672545 hartree
cpcmener: -0.04862693 hartree
kineticenergy: 1798.95540967 hartree
xcener: -147.733233890253 hartree
chargesum: -0.0000000
charge: -0.072233 -0.211056 -0.427434 -0.425981 -0.314203 -0.293594 -0.462408 -0.033798 -0.155778 -0.128563 -0.070060 -0.073977 -0.047056 -0.105201 0.333570 0.322419 -0.014684 -0.162908 0.190440 0.278741 -0.119841 -0.112783 -0.135753 -0.017743 -0.102682 0.004269 -0.285097 0.024658 0.396509 0.084792 0.086321 0.078716 0.081193 0.096450 0.106463 0.098259 0.105382 0.140792 0.065865 0.079415 0.075786 0.086519 0.135045 0.059233 0.071806 0.114128 0.114572 0.095634 0.073395 0.085705 0.138586 0.148172
qa: -0.0722 -0.2111 -0.4274 -0.4260 -0.3142 -0.2936 -0.4624 -0.0338 -0.1558 -0.1286 -0.0701 -0.0740 -0.0471 -0.1052 0.3336 0.3224 -0.0147 -0.1629 0.1904 0.2787 -0.1198 -0.1128 -0.1358 -0.0177 -0.1027 0.0043 -0.2851 0.0247 0.3965 0.0848 0.0863 0.0787 0.0812 0.0964 0.1065 0.0983 0.1054 0.1408 0.0659 0.0794 0.0758 0.0865 0.1350 0.0592 0.0718 0.1141 0.1146 0.0956 0.0734 0.0857 0.1386 0.1482
va: 1.2393 1.0831 2.0851 2.0809 2.0985 2.1316 2.0311 3.0357 3.9207 3.9065 3.8993 3.9138 3.6313 3.6804 4.1324 4.1261 3.6915 3.9404 4.1236 3.9096 3.8591 3.9881 3.8389 3.8860 3.9306 3.8513 3.9459 3.8850 4.0922 1.0049 1.0108 1.0068 1.0101 1.0150 1.0038 1.0160 1.0032 1.0194 1.0191 1.0115 1.0258 1.0165 1.0144 1.0085 1.0063 0.9990 1.0120 1.0031 0.9978 0.9984 0.9982 0.9949
dispcorr: -0.030610617 hartree
energy: -1805.236513030006
dipole: -31.73018 29.70353 -2.02665 -48.64981 45.58003 -3.06978 -17.43210 17.53177 0.09967
magnitude: 3.67978 au
magnitude: 9.35326 debye
