program: Orca
programVersion: 5.0.2
elementType: Cl F O O O O O N C C C C C C C C C C C C C C C C C C C C C H H H H H H H H H H H H H H H H H H H H H H H
charge: 0
multiplicity: 1
keywords: wb97x-d3
keywords: def2-TZVPP
keywords: def2/J RIJCOSX
keywords: DEFGRID2
keywords: scfconv7
keywords: smallprint printgap noloewdin
keywords: NOSOSCF
formula: C21H23ClFNO5
InChI: InChI=1/C21H23ClFNO5/c1-2-3-6-9-28-19(25)12-29-18-11-17(16(23)10-15(18)22)24-20(26)13-7-4-5-8-14(13)21(24)27/h10-11H,2-9,12H2,1H3
52 atoms
Cl 4.064747 -0.33217 -2.202406
F  -0.665957 1.348565 -2.487706
O  -2.522604 -0.950067 -2.555494
O  -1.406845 0.228457 1.693311
O  2.972849 -1.924274 -0.086058
O  3.148961 -0.263031 1.948938
O  1.973458 -1.616469 3.303316
N  -1.585355 -0.3393 -0.538514
C  -6.247301 -0.011325 -0.113002
C  -5.900017 -0.382242 1.327737
C  -5.269491 -0.630296 -1.113206
C  -4.516856 0.129721 1.733569
C  -3.884118 -0.460633 -0.612764
C  -3.554576 -0.12167 0.634121
C  -2.641696 -0.624729 -1.40236
C  -2.077668 -0.03783 0.729159
C  -0.232922 -0.333854 -0.91217
C  0.682046 -1.168055 -0.283831
C  0.202326 0.505944 -1.921824
C  2.018263 -1.16101 -0.658928
C  2.221816 2.397897 0.997877
C  1.513563 0.499642 -2.346871
C  2.013588 1.84664 2.405442
C  2.415538 -0.333011 -1.710562
C  1.386381 3.636174 0.68787
C  3.084912 0.869504 2.839911
C  -0.118135 3.406542 0.727551
C  2.716076 -2.450694 1.195266
C  2.549378 -1.389715 2.267491
H  -7.262033 -0.333743 -0.348299
H  -6.229714 1.076746 -0.221045
H  -6.650288 0.020243 2.008925
H  -5.926804 -1.469709 1.437014
H  -5.476091 -1.696392 -1.249406
H  -5.375932 -0.173153 -2.099375
H  -4.547103 1.203712 1.942937
H  -4.176902 -0.348454 2.654823
H  0.319768 -1.833063 0.488826
H  2.00086 1.623935 0.257521
H  3.279252 2.651063 0.868613
H  1.02938 1.382561 2.504558
H  2.040485 2.667296 3.129656
H  1.82945 1.157156 -3.145701
H  1.651832 4.433979 1.389114
H  1.663526 4.002198 -0.304755
H  4.071783 1.328315 2.778478
H  2.930318 0.538153 3.866556
H  -0.657937 4.314224 0.453784
H  -0.418867 2.626437 0.025606
H  -0.463912 3.112567 1.719827
H  3.59068 -3.051425 1.455426
H  1.854514 -3.121872 1.213846
elementType: Cl F O N C H
totalener: -1805.20371392 hartree
nucrepener: 3152.82620879 hartree
electener: -4958.02992271 hartree
oneelecener: -8744.36438477 hartree
twoeener: 3786.33446207 hartree
cpcmener: -0.04487184 hartree
kineticenergy: 1798.94473967 hartree
xcener: -147.731587633236 hartree
chargesum: 0.0000000
charge: -0.069613 -0.214262 -0.426125 -0.437412 -0.322436 -0.267568 -0.474856 -0.005298 -0.134373 -0.135457 -0.076047 -0.073155 -0.084822 -0.028816 0.353107 0.299416 -0.014056 -0.155361 0.160098 0.236015 -0.024121 -0.096071 -0.134018 0.034630 -0.109299 -0.008116 -0.278353 0.024524 0.396561 0.080677 0.079044 0.081104 0.078822 0.102426 0.093826 0.103415 0.094423 0.147537 -0.035315 0.082093 0.074471 0.083848 0.134541 0.061667 0.069586 0.112294 0.107792 0.100437 0.061806 0.083864 0.143644 0.123283
qa: -0.0696 -0.2143 -0.4261 -0.4374 -0.3224 -0.2676 -0.4749 -0.0053 -0.1344 -0.1355 -0.0760 -0.0732 -0.0848 -0.0288 0.3531 0.2994 -0.0141 -0.1554 0.1601 0.2360 -0.0241 -0.0961 -0.1340 0.0346 -0.1093 -0.0081 -0.2784 0.0245 0.3966 0.0807 0.0790 0.0811 0.0788 0.1024 0.0938 0.1034 0.0944 0.1475 -0.0353 0.0821 0.0745 0.0838 0.1345 0.0617 0.0696 0.1123 0.1078 0.1004 0.0618 0.0839 0.1436 0.1233
va: 1.2424 1.0687 2.0897 2.0635 2.0876 2.1421 2.0271 3.0365 3.9162 3.9170 3.9158 3.9145 3.7367 3.7247 4.1514 4.1372 3.6986 3.8513 4.0241 3.8933 3.8199 3.9685 3.8770 3.8588 3.8954 3.8661 3.9415 3.9014 4.0948 1.0095 1.0063 1.0091 1.0064 1.0046 1.0155 1.0045 1.0161 1.0212 1.0697 1.0146 1.0205 1.0179 1.0158 1.0096 1.0071 0.9991 1.0201 1.0085 0.9960 0.9995 0.9892 1.0025
dispcorr: -0.032232544 hartree
energy: -1805.235946459771
dipole: -24.00387 22.50409 -1.49978 17.66332 -17.33576 0.32756 24.37334 -23.63613 0.73721
magnitude: 1.70297 au
magnitude: 4.32860 debye
