program: Orca
programVersion: 5.0.2
elementType: Cl F O O O O O N C C C C C C C C C C C C C C C C C C C C C H H H H H H H H H H H H H H H H H H H H H H H
charge: 0
multiplicity: 1
keywords: wb97x-d3
keywords: def2-TZVPP
keywords: def2/J RIJCOSX
keywords: DEFGRID2
keywords: scfconv7
keywords: smallprint printgap noloewdin
keywords: NOSOSCF
formula: C21H23ClFNO5
InChI: InChI=1/C21H23ClFNO5/c1-2-3-6-9-28-19(25)12-29-18-11-17(16(23)10-15(18)22)24-20(26)13-7-4-5-8-14(13)21(24)27/h10-11H,2-9,12H2,1H3
52 atoms
Cl 3.480056 3.056492 1.842507
F  -1.437494 2.805133 2.840343
O  -2.260616 1.985616 -1.451316
O  -2.400711 0.025072 2.650498
O  2.73379 1.467889 -0.40104
O  2.252007 -1.402387 -2.438195
O  2.48633 -1.232293 -0.211621
N  -1.979017 1.165285 0.689249
C  -6.066105 -0.468484 -0.957566
C  -6.411103 -0.375022 0.528112
C  -5.043066 0.589781 -1.376666
C  -5.187028 -0.615016 1.413536
C  -3.974571 0.676708 -0.351851
C  -4.030126 0.132931 0.864538
C  -2.670792 1.366756 -0.504741
C  -2.748974 0.397511 1.562312
C  -0.679129 1.622067 0.955495
C  0.373589 1.268198 0.118911
C  -0.42875 2.430852 2.049698
C  1.661086 1.722443 0.367592
C  3.293548 -5.044794 -2.319841
C  0.847012 2.865841 2.341337
C  3.469539 -3.531254 -2.298748
C  1.882901 2.513158 1.498545
C  4.608727 -5.796925 -2.16565
C  2.127827 -2.835137 -2.396191
C  4.42294 -7.305772 -2.159842
C  2.578859 0.736804 -1.586653
C  2.431403 -0.74423 -1.309627
H  -5.664227 -1.462857 -1.172903
H  -6.969591 -0.360546 -1.559563
H  -6.821461 0.615863 0.743316
H  -7.190185 -1.096603 0.778769
H  -4.611872 0.349526 -2.351411
H  -5.518857 1.568689 -1.491922
H  -5.382739 -0.30652 2.443127
H  -4.942789 -1.680973 1.460705
H  0.153353 0.629652 -0.725495
H  2.809796 -5.345775 -3.255175
H  2.61325 -5.342651 -1.514799
H  4.104596 -3.218633 -3.132652
H  3.98108 -3.238105 -1.37844
H  1.022415 3.487582 3.209214
H  5.288349 -5.513312 -2.975084
H  5.095483 -5.48494 -1.23673
H  1.629803 -3.090335 -3.331409
H  1.467646 -3.125875 -1.576343
H  3.97305 -7.655366 -3.091324
H  5.374514 -7.825919 -2.039831
H  3.771878 -7.622653 -1.342504
H  3.493017 0.894376 -2.163821
H  1.749734 1.102236 -2.202415
elementType: Cl F O N C H
totalener: -1805.21785699 hartree
nucrepener: 2899.40318208 hartree
electener: -4704.62103908 hartree
oneelecener: -8237.31952150 hartree
twoeener: 3532.69848242 hartree
cpcmener: -0.03906286 hartree
kineticenergy: 1798.95823731 hartree
xcener: -147.727558246244 hartree
chargesum: 0.0000000
charge: -0.072462 -0.209598 -0.402815 -0.397225 -0.305757 -0.294276 -0.436376 -0.064093 -0.136185 -0.135784 -0.076329 -0.074341 -0.069882 -0.074323 0.314963 0.325243 -0.007779 -0.155092 0.182705 0.277465 -0.121964 -0.110784 -0.123351 -0.013690 -0.080545 0.020248 -0.276794 0.012782 0.384697 0.078761 0.080826 0.078865 0.080901 0.094066 0.101628 0.094367 0.101572 0.140102 0.065892 0.065845 0.070874 0.076420 0.133139 0.056614 0.057712 0.115338 0.100040 0.077801 0.089980 0.077910 0.145701 0.136985
qa: -0.0725 -0.2096 -0.4028 -0.3972 -0.3058 -0.2943 -0.4364 -0.0641 -0.1362 -0.1358 -0.0763 -0.0743 -0.0699 -0.0743 0.3150 0.3252 -0.0078 -0.1551 0.1827 0.2775 -0.1220 -0.1108 -0.1234 -0.0137 -0.0805 0.0202 -0.2768 0.0128 0.3847 0.0788 0.0808 0.0789 0.0809 0.0941 0.1016 0.0944 0.1016 0.1401 0.0659 0.0658 0.0709 0.0764 0.1331 0.0566 0.0577 0.1153 0.1000 0.0778 0.0900 0.0779 0.1457 0.1370
va: 1.2386 1.0847 2.1158 2.1249 2.1061 2.1378 2.0661 3.0632 3.9140 3.9136 3.9198 3.9182 3.6894 3.6953 4.1889 4.1967 3.7101 3.9378 4.1235 3.9247 3.8916 3.9776 3.8632 3.8846 3.8775 3.8474 3.9467 3.8811 4.0913 1.0064 1.0093 1.0065 1.0095 1.0152 1.0052 1.0152 1.0054 1.0216 1.0094 1.0080 1.0156 1.0236 1.0147 1.0067 1.0072 1.0005 1.0125 1.0007 1.0044 1.0011 0.9961 0.9993
dispcorr: -0.024278913 hartree
energy: -1805.242135906254
dipole: -3.76110 2.06561 -1.69549 -57.65557 56.15790 -1.49767 -31.41911 28.95772 -2.46139
magnitude: 3.34307 au
magnitude: 8.49742 debye
