program: Orca
programVersion: 5.0.2
elementType: Cl F O O O O O N C C C C C C C C C C C C C C C C C C C C C H H H H H H H H H H H H H H H H H H H H H H H
charge: 0
multiplicity: 1
keywords: wb97x-d3
keywords: def2-TZVPP
keywords: def2/J RIJCOSX
keywords: DEFGRID2
keywords: scfconv7
keywords: smallprint printgap noloewdin
keywords: NOSOSCF
formula: C21H23ClFNO5
InChI: InChI=1/C21H23ClFNO5/c1-2-3-6-9-28-19(25)12-29-18-11-17(16(23)10-15(18)22)24-20(26)13-7-4-5-8-14(13)21(24)27/h10-11H,2-9,12H2,1H3
52 atoms
Cl 3.493509 2.732424 1.886982
F  -1.494852 3.251478 2.253837
O  -1.94571 -1.109937 2.392973
O  -2.799225 2.429798 -0.328577
O  2.778593 0.208118 0.774047
O  1.954862 -2.275865 -1.630098
O  2.091588 -0.045947 -1.847781
N  -2.016582 0.805309 1.108598
C  -6.066794 -1.489783 0.499594
C  -6.566335 -0.058937 0.30544
C  -4.891941 -1.557567 1.477289
C  -5.486539 0.850793 -0.283999
C  -3.936084 -0.464356 1.173748
C  -4.193558 0.585299 0.392487
C  -2.540591 -0.359759 1.665624
C  -2.972955 1.424117 0.30623
C  -0.702335 1.262889 1.290214
C  0.373799 0.47428 0.901992
C  -0.463728 2.498527 1.862981
C  1.677109 0.910266 1.090993
C  3.84954 -3.559512 -3.557646
C  0.820823 2.968385 2.040398
C  2.833372 -2.480817 -3.912753
C  1.882257 2.17023 1.659361
C  5.030163 -3.596152 -4.519063
C  1.612834 -2.46757 -3.016516
C  6.037377 -4.681172 -4.169992
C  2.638176 -1.084675 0.249357
C  2.193867 -1.053209 -1.198493
H  -6.877995 -2.124072 0.859684
H  -5.75537 -1.89923 -0.465762
H  -7.442485 -0.052717 -0.344418
H  -6.8893 0.344776 1.269337
H  -5.239598 -1.459264 2.511114
H  -4.39043 -2.526923 1.419464
H  -5.374492 0.676448 -1.359123
H  -5.761357 1.903096 -0.177856
H  0.158555 -0.484598 0.450826
H  3.354129 -4.536718 -3.554189
H  4.224491 -3.403126 -2.541423
H  2.464795 -2.644188 -4.930532
H  3.309873 -1.496577 -3.919178
H  0.987351 3.940392 2.485549
H  4.664979 -3.750227 -5.53926
H  5.52783 -2.621463 -4.519071
H  0.895038 -1.70807 -3.330997
H  1.109057 -3.433725 -3.039057
H  6.447578 -4.536428 -3.168421
H  5.579775 -5.672386 -4.195824
H  6.875429 -4.689621 -4.868711
H  1.971447 -1.711746 0.850866
H  3.629551 -1.541741 0.295379
elementType: Cl F O N C H
totalener: -1805.21801402 hartree
nucrepener: 2916.67338182 hartree
electener: -4721.89139584 hartree
oneelecener: -8271.80987345 hartree
twoeener: 3549.91847761 hartree
cpcmener: -0.03958879 hartree
kineticenergy: 1798.96072507 hartree
xcener: -147.727769314383 hartree
chargesum: -0.0000000
charge: -0.071880 -0.209710 -0.401657 -0.398532 -0.306155 -0.297247 -0.434532 -0.065972 -0.135549 -0.134093 -0.076043 -0.075785 -0.067103 -0.079374 0.315226 0.329042 -0.014342 -0.156857 0.187930 0.281552 -0.108240 -0.113532 -0.129517 -0.011808 -0.082117 0.001402 -0.276148 0.016539 0.383166 0.080779 0.078493 0.080406 0.078103 0.101605 0.093038 0.101531 0.094943 0.139434 0.059379 0.062557 0.082638 0.075693 0.133484 0.055603 0.056956 0.113967 0.114232 0.077816 0.077547 0.090158 0.137898 0.145081
qa: -0.0719 -0.2097 -0.4017 -0.3985 -0.3062 -0.2972 -0.4345 -0.0660 -0.1355 -0.1341 -0.0760 -0.0758 -0.0671 -0.0794 0.3152 0.3290 -0.0143 -0.1569 0.1879 0.2816 -0.1082 -0.1135 -0.1295 -0.0118 -0.0821 0.0014 -0.2761 0.0165 0.3832 0.0808 0.0785 0.0804 0.0781 0.1016 0.0930 0.1015 0.0949 0.1394 0.0594 0.0626 0.0826 0.0757 0.1335 0.0556 0.0570 0.1140 0.1142 0.0778 0.0775 0.0902 0.1379 0.1451
va: 1.2393 1.0852 2.1176 2.1242 2.1072 2.1163 2.0690 3.0534 3.9141 3.9143 3.9196 3.9208 3.6806 3.6955 4.1899 4.1940 3.7028 3.9447 4.1303 3.9171 3.8516 3.9796 3.8573 3.8887 3.8789 3.8602 3.9453 3.8769 4.0865 1.0096 1.0067 1.0095 1.0064 1.0047 1.0158 1.0052 1.0151 1.0238 1.0097 1.0177 1.0153 1.0220 1.0147 1.0074 1.0069 1.0127 0.9973 1.0012 1.0008 1.0042 1.0003 0.9944
dispcorr: -0.024798266 hartree
energy: -1805.242812286308
dipole: 0.08763 -1.70678 -1.61915 -47.28592 44.44916 -2.83675 -38.67666 37.87525 -0.80141
magnitude: 3.36319 au
magnitude: 8.54856 debye
