program: Orca
programVersion: 5.0.2
elementType: Cl F O O O O O N C C C C C C C C C C C C C C C C C C C C C H H H H H H H H H H H H H H H H H H H H H H H
charge: 0
multiplicity: 1
keywords: wb97x-d3
keywords: def2-TZVPP
keywords: def2/J RIJCOSX
keywords: DEFGRID2
keywords: scfconv7
keywords: smallprint printgap noloewdin
keywords: NOSOSCF
formula: C21H23ClFNO5
InChI: InChI=1/C21H23ClFNO5/c1-2-3-6-9-28-19(25)12-29-18-11-17(16(23)10-15(18)22)24-20(26)13-7-4-5-8-14(13)21(24)27/h10-11H,2-9,12H2,1H3
52 atoms
Cl 4.06189 2.705885 2.11912
F  -0.831537 3.507481 1.292463
O  -1.673069 -0.764655 2.202599
O  -1.633186 2.159365 -1.278876
O  3.356416 0.021345 1.464449
O  2.547612 -2.989325 -0.215131
O  3.277983 -1.038711 -1.064257
N  -1.331096 0.873432 0.611356
C  -5.145754 -1.568435 -0.62043
C  -5.534252 -0.210733 -1.203974
C  -4.28459 -1.423493 0.635341
C  -4.310628 0.601581 -1.633698
C  -3.245358 -0.391111 0.400211
C  -3.250207 0.486945 -0.603481
C  -2.025962 -0.174225 1.216246
C  -2.015228 1.305491 -0.523835
C  -0.050433 1.312235 0.983444
C  1.007879 0.411471 1.021709
C  0.180677 2.637127 1.304248
C  2.281969 0.825474 1.380247
C  0.434603 -2.222678 -2.427849
C  1.442808 3.081695 1.64138
C  0.933695 -3.583548 -1.957656
C  2.484003 2.174806 1.682656
C  -0.976131 -2.289633 -3.00209
C  2.374379 -3.630115 -1.493645
C  -1.398649 -0.992323 -3.673374
C  3.175455 -1.361904 1.31644
C  3.002941 -1.754529 -0.138227
H  -6.041278 -2.145197 -0.384953
H  -4.592857 -2.141453 -1.37095
H  -6.198384 -0.346892 -2.058647
H  -6.098571 0.354605 -0.456855
H  -4.897397 -1.135177 1.495705
H  -3.819493 -2.375539 0.902576
H  -3.921368 0.242013 -2.591492
H  -4.573538 1.650263 -1.792349
H  0.800062 -0.617392 0.761759
H  1.117559 -1.834668 -3.190637
H  0.446289 -1.498632 -1.607063
H  0.862917 -4.292694 -2.788557
H  0.285215 -3.97879 -1.169657
H  1.60236 4.123725 1.885624
H  -1.034355 -3.105686 -3.729123
H  -1.683731 -2.541464 -2.205734
H  2.681463 -4.662155 -1.32646
H  3.048285 -3.194955 -2.233293
H  -2.418018 -1.053582 -4.057767
H  -1.355161 -0.149054 -2.982718
H  -0.746411 -0.753677 -4.515728
H  2.350426 -1.740708 1.927888
H  4.090024 -1.830745 1.688108
elementType: Cl F O N C H
totalener: -1805.21617839 hartree
nucrepener: 3099.92678870 hartree
electener: -4905.14296709 hartree
oneelecener: -8637.90096104 hartree
twoeener: 3732.75799395 hartree
cpcmener: -0.04011913 hartree
kineticenergy: 1798.94957152 hartree
xcener: -147.726591949740 hartree
chargesum: -0.0000000
charge: -0.070573 -0.208196 -0.399220 -0.397638 -0.305421 -0.283943 -0.429751 -0.039990 -0.138354 -0.130818 -0.077198 -0.070668 -0.054697 -0.096177 0.310518 0.303282 0.011943 -0.188163 0.185566 0.291167 -0.095859 -0.100757 -0.103977 -0.029270 -0.086713 0.004225 -0.303180 0.021476 0.364143 0.082964 0.077320 0.080950 0.078973 0.103851 0.093471 0.105101 0.100155 0.133569 0.066860 0.043889 0.072911 0.071602 0.133305 0.064160 0.054468 0.116823 0.101836 0.096075 0.068406 0.097780 0.132175 0.141598
qa: -0.0706 -0.2082 -0.3992 -0.3976 -0.3054 -0.2839 -0.4298 -0.0400 -0.1384 -0.1308 -0.0772 -0.0707 -0.0547 -0.0962 0.3105 0.3033 0.0119 -0.1882 0.1856 0.2912 -0.0959 -0.1008 -0.1040 -0.0293 -0.0867 0.0042 -0.3032 0.0215 0.3641 0.0830 0.0773 0.0810 0.0790 0.1039 0.0935 0.1051 0.1002 0.1336 0.0669 0.0439 0.0729 0.0716 0.1333 0.0642 0.0545 0.1168 0.1018 0.0961 0.0684 0.0978 0.1322 0.1416
va: 1.2405 1.0873 2.1186 2.1161 2.1113 2.1352 2.0715 3.0430 3.9151 3.9100 3.9158 3.9047 3.6480 3.6720 4.1868 4.1706 3.6812 3.9455 4.1237 3.9344 3.8777 3.9685 3.8727 3.8999 3.8622 3.8652 3.9470 3.8897 4.1238 1.0101 1.0088 1.0098 1.0071 1.0041 1.0163 1.0095 1.0165 1.0268 1.0153 1.0068 1.0160 1.0144 1.0144 1.0108 1.0073 0.9991 1.0153 1.0010 1.0049 1.0058 1.0039 0.9920
dispcorr: -0.030290818 hartree
energy: -1805.246469213337
dipole: -32.56476 30.52380 -2.04096 -38.74559 35.84256 -2.90303 -33.23923 32.80062 -0.43861
magnitude: 3.57568 au
magnitude: 9.08866 debye
