program: Gaussian 09
title: 000056615
version: EM64L-G09RevD.01
frameworkgroup: C1[X(C17H15N3O)]
method: RPBEPBE
basis: SDD
operation: Freq
keyword: #p
keyword: freq=noraman
keyword: PBEPBE/SDD
title: #p freq=noraman PBEPBE/SDD
converged: YES YES NO NO
title: Mulliken charges:
elementType: O N N N C C C C C C C C C C C C C C C C C H H H H H H H H H H H H H H H
charge: -0.225995 -0.226200 -0.416418 0.003135 0.286962 0.385326 0.302293 -0.399825 -0.409779 -0.794537 -0.365712 -0.407054 0.182911 0.324555 -0.248137 -0.229956 -0.241548 -0.292673 -0.325004 -0.326085 -0.328961 0.255919 0.249727 0.331372 0.262948 0.243460 0.220338 0.262335 0.244337 0.227604 0.225653 0.229849 0.272710 0.230203 0.249552 0.246696
chargesum: 0.00000
title: Mulliken charges with hydrogens summed into heavy atoms:
elementType: O N N N C C C C C C C C C C C C C C C C C
charge: -0.225995 -0.226200 -0.085046 0.003135 0.286962 0.385326 0.302293 -0.143906 -0.160052 -0.067791 -0.103378 -0.162717 0.182911 0.324555 -0.020533 -0.004303 -0.011699 -0.019962 -0.094802 -0.076533 -0.082265
polarizability: 2.37588673e+02 1.24057781e+01 2.41735959e+02 -1.28784651e+01 -7.18691863e+00 1.47865445e+02
1716.lowfreq: -8.7168 -4.9978 -0.0006 -0.0006 -0.0004 2.9295 23.7269 26.4431 44.3298
frequency: 23.6674 26.4273 44.3139 61.2733 72.4535 81.6153 104.1922 135.9892 148.5317 171.8746 198.7215 232.9555 280.9784 300.2425 303.6792 321.7679 363.6941 388.5447 402.4128 410.0405 470.0716 502.6225 514.6578 549.0570 609.0941 612.9636 623.7326 644.0420 659.1863 659.9377 693.7254 706.1162 711.8741 752.8089 760.8219 777.1291 786.2014 838.4758 848.5071 856.7192 877.8258 890.9920 920.7006 929.3399 958.2899 969.5673 971.0090 978.9679 986.6792 988.3856 996.9355 1026.2789 1036.4598 1045.7424 1059.3626 1076.9336 1080.7531 1091.8738 1103.2917 1172.5874 1192.2567 1206.8258 1219.1545 1249.3643 1262.6156 1299.4510 1311.2510 1324.8587 1329.8102 1347.8979 1370.2941 1398.0415 1398.8411 1401.3607 1437.6395 1457.2991 1462.1158 1467.5644 1477.1974 1487.2646 1539.5248 1547.8985 1575.2134 1580.4476 1585.2372 1615.8956 1617.4881 2970.7429 3042.9036 3100.1116 3123.9971 3130.5541 3130.8885 3142.7035 3144.2710 3152.2016 3153.2636 3165.9482 3174.0626 3206.9603 3226.4218 3511.3896
redmass: 5.1702 4.7625 4.0036 6.1947 4.2206 5.0727 4.0801 4.2134 1.1881 5.2170 3.8734 4.2647 5.2668 5.0488 3.7019 5.8815 2.4784 5.4100 6.4970 2.9052 3.8063 2.5175 1.6154 3.4475 4.4810 5.0656 6.3039 3.6417 6.7559 6.4821 4.0948 1.9474 5.3375 2.9227 1.6253 1.5999 3.4402 1.7322 1.3831 1.2452 6.2049 1.2648 2.4017 2.1858 4.2625 1.6250 1.6460 1.6331 1.4534 3.1407 1.3704 2.2244 1.3355 1.4456 2.4380 2.1088 1.6381 1.9963 2.9314 1.0553 1.1222 1.8949 1.3025 3.2006 2.5870 7.1673 1.7135 1.6082 2.3917 5.1643 5.1919 4.7714 1.9303 1.2406 2.4141 1.7151 1.1047 2.2986 1.1806 1.6892 5.7150 7.4717 5.5887 5.5873 6.1314 6.1965 8.6628 1.0388 1.0978 1.0964 1.0845 1.0876 1.0877 1.0897 1.0925 1.0964 1.0974 1.1016 1.0968 1.0927 1.1036 1.0781
irintensity: 0.2748 0.0592 0.2043 1.8570 3.6355 1.1665 1.6818 5.3106 1.5168 7.3506 2.4896 5.4454 1.1742 1.7827 4.2980 0.0890 0.2518 1.7696 2.9938 0.1694 8.3121 45.0606 50.5534 15.3973 3.3882 1.8004 38.1208 3.3711 0.7998 10.9714 25.8608 38.8735 4.5037 10.3217 98.4935 24.2012 15.7982 28.3793 0.2066 0.2468 9.7203 2.2120 9.7813 3.9349 1.1699 0.4980 2.0344 0.5917 0.6442 0.5222 1.0814 8.1316 9.4423 5.6618 19.2345 14.4685 3.9553 0.7762 9.4449 0.0560 2.3049 13.6365 6.5190 92.8531 84.4846 0.2023 0.5913 2.8690 0.2684 6.2822 0.2655 12.1715 15.6968 2.3627 16.0876 27.8784 23.3324 12.7048 28.3105 92.3099 60.8651 31.4025 3.2180 6.1598 1.8418 35.7716 96.5015 43.7049 14.9626 17.8190 2.9148 7.8669 2.6918 20.3165 17.6784 27.5318 18.0357 21.7710 4.1867 7.9389 2.4914 22.4013
temp: 298.150 k
press: 1.00000 atm
elementType: 8 7 7 7 6 6 6 6 6 6 6 6 6 6 6 6 6 6 6 6 6 1 1 1 1 1 1 1 1 1 1 1 1 1 1 1
symmnumber: 1
zpe: 737810.7 jmol-1
zpe.correction: 0.281017 hartree
zpe.thermalcorrener: 0.299078 hartree
zpe.thermalcorrenthalpy: 0.300022 hartree
zpe.thermalcorrgfe: 0.232759 hartree
zpe.sumelectzpe: -894.798531 hartree
zpe.sumelectthermal: -894.780471 hartree
zpe.sumelectthermalent: -894.779527 hartree
zpe.sumelectthermalfe: -894.846790 hartree
dipole: 0.4281 0.0771 -2.7967
dipole: 2.8303
quadrupole: -129.8768 -113.6901 -122.4406
quadrupole: -4.6125 -4.7825 -7.2297
quadrupole: -7.8743 8.3124 -0.4381 -4.6125 -4.7825 -7.2297
hfenergy: -895.0795484 hartree
pointgroup: C01 [X(C17H15N3O1)]
dipole: 0.082109 -0.043795 1.1096309 debye
polarizability: 237.6096096|-12.6601955|239.26681|20.4449784|-4.1217324|150.3136576 unknown
InChI: InChI=1S/C17H15N3O/c1-13-7-8-16(14-5-3-2-4-6-14)20(13)19-17(21)15-9-11-18-12-10-15/h2-12,19H,1H3
charge 0 multiplicity 1
36 atoms
O  -0.80028 -1.059759 -1.919076
N  1.104585 -1.344975 0.154679
N  -0.203621 -0.893449 0.335246
N  -5.129097 0.575838 0.277578
C  2.263149 -0.525867 0.227998
C  1.457068 -2.712088 0.132933
C  2.230085 0.944672 0.247847
C  3.352114 -1.408701 0.248834
C  2.853882 -2.756666 0.17688
C  0.424809 -3.795425 0.046295
C  1.333595 1.691068 -0.570965
C  3.144765 1.656762 1.074989
C  -1.10917 -0.790964 -0.724835
C  -2.488842 -0.327676 -0.325301
C  1.343818 3.10182 -0.545353
C  3.161706 3.067291 1.086612
C  2.254688 3.798321 0.283422
C  -3.289993 0.293089 -1.314863
C  -3.042244 -0.505238 0.968397
C  -4.587204 0.728421 -0.969918
C  -4.354077 -0.040619 1.217825
H  4.397062 -1.102126 0.247454
H  3.450019 -3.667057 0.137372
H  -0.433354 -0.517719 1.259023
H  -0.155374 -3.727518 -0.893346
H  0.92096 -4.779033 0.0704
H  -0.295713 -3.759701 0.886372
H  0.670916 1.16579 -1.266895
H  3.830253 1.093184 1.71801
H  0.652651 3.65871 -1.188119
H  3.874276 3.596299 1.72954
H  2.262491 4.893736 0.297798
H  -2.896836 0.416062 -2.328217
H  -2.500335 -1.02601 1.765507
H  -5.229751 1.217712 -1.70976
H  -4.813502 -0.168585 2.204237
