program: Orca
programVersion: 5.0.2
elementType: Cl F O O O O O N C C C C C C C C C C C C C C C C C C C C C H H H H H H H H H H H H H H H H H H H H H H H
charge: 0
multiplicity: 1
keywords: wb97x-d3
keywords: def2-TZVPP
keywords: def2/J RIJCOSX
keywords: DEFGRID2
keywords: scfconv7
keywords: smallprint printgap noloewdin
keywords: NOSOSCF
formula: C21H23ClFNO5
InChI: InChI=1/C21H23ClFNO5/c1-2-3-6-9-28-19(25)12-29-18-11-17(16(23)10-15(18)22)24-20(26)13-7-4-5-8-14(13)21(24)27/h10-11H,2-9,12H2,1H3
52 atoms
Cl 4.134984 2.918162 1.135599
F  -0.679274 3.614678 -0.119312
O  -1.533587 1.459313 -1.991999
O  -1.851128 0.114874 2.339555
O  3.260869 0.234448 1.540257
O  2.956718 -1.800015 -0.122685
O  2.661521 -3.289227 1.528061
N  -1.35121 0.966459 0.253237
C  -5.64031 -0.348896 -1.16383
C  -5.390905 -1.396695 -0.079941
C  -4.340634 0.113417 -1.82556
C  -4.52056 -0.850664 1.053508
C  -3.301921 0.322811 -0.78793
C  -3.385137 -0.08992 0.477255
C  -1.993062 0.992372 -0.983948
C  -2.146726 0.308192 1.190188
C  -0.047417 1.432312 0.481923
C  0.944092 0.556386 0.909061
C  0.270882 2.76155 0.269533
C  2.23968 1.002689 1.123911
C  0.570994 -1.995615 -2.053978
C  1.555892 3.227557 0.452352
C  1.359079 -3.142802 -1.430977
C  2.530001 2.34855 0.88415
C  -0.922581 -2.282741 -2.178017
C  2.809703 -2.813993 -1.138971
C  -1.259514 -3.502852 -3.022673
C  3.004984 -1.020432 2.115732
C  2.846907 -2.164119 1.136386
H  -6.312929 -0.749225 -1.923608
H  -6.146963 0.514213 -0.722856
H  -6.340246 -1.748983 0.325803
H  -4.898037 -2.266744 -0.523595
H  -3.983151 -0.631751 -2.544296
H  -4.498053 1.030678 -2.397977
H  -5.102295 -0.196398 1.710488
H  -4.150455 -1.660591 1.686463
H  0.674096 -0.480616 1.055905
H  0.983635 -1.772441 -3.04358
H  0.701482 -1.08637 -1.460453
H  1.37475 -3.997027 -2.113663
H  0.863587 -3.495959 -0.522069
H  1.784563 4.270453 0.277512
H  -1.350576 -2.403283 -1.177502
H  -1.409211 -1.4063 -2.613422
H  3.366139 -3.706184 -0.848104
H  3.295454 -2.389556 -2.017402
H  -2.338886 -3.605841 -3.146647
H  -0.821561 -3.428513 -4.020659
H  -0.899177 -4.429244 -2.573094
H  2.132333 -1.004778 2.777695
H  3.869815 -1.250326 2.741943
elementType: Cl F O N C H
totalener: -1805.21521138 hartree
nucrepener: 3110.97367440 hartree
electener: -4916.18888578 hartree
oneelecener: -8659.48900647 hartree
twoeener: 3743.30012069 hartree
cpcmener: -0.03699098 hartree
kineticenergy: 1798.94864896 hartree
xcener: -147.728321105306 hartree
chargesum: -0.0000000
charge: -0.071364 -0.208130 -0.400200 -0.400057 -0.310963 -0.269339 -0.459290 -0.018598 -0.137173 -0.132193 -0.062102 -0.073808 -0.090953 -0.053810 0.277243 0.317862 0.025619 -0.240715 0.186582 0.306846 -0.110747 -0.106958 -0.139378 -0.021666 -0.099872 -0.002257 -0.284765 0.006164 0.396449 0.081240 0.079146 0.080881 0.076514 0.100346 0.097718 0.101072 0.093216 0.149568 0.078843 0.067710 0.086006 0.081413 0.132463 0.057610 0.055814 0.113621 0.112064 0.091612 0.083188 0.084788 0.132029 0.140710
qa: -0.0714 -0.2081 -0.4002 -0.4001 -0.3110 -0.2693 -0.4593 -0.0186 -0.1372 -0.1322 -0.0621 -0.0738 -0.0910 -0.0538 0.2772 0.3179 0.0256 -0.2407 0.1866 0.3068 -0.1107 -0.1070 -0.1394 -0.0217 -0.0999 -0.0023 -0.2848 0.0062 0.3964 0.0812 0.0791 0.0809 0.0765 0.1003 0.0977 0.1011 0.0932 0.1496 0.0788 0.0677 0.0860 0.0814 0.1325 0.0576 0.0558 0.1136 0.1121 0.0916 0.0832 0.0848 0.1320 0.1407
va: 1.2398 1.0876 2.1028 2.1176 2.0954 2.1565 2.0521 3.0312 3.9187 3.9103 3.9087 3.9195 3.6870 3.6427 4.1589 4.1785 3.6525 3.9092 4.1368 3.9172 3.8539 3.9748 3.8462 3.8874 3.8681 3.8632 3.9452 3.9208 4.1022 1.0096 1.0067 1.0099 1.0092 1.0074 1.0166 1.0044 1.0164 1.0149 1.0108 1.0173 1.0124 1.0219 1.0153 1.0078 1.0190 1.0120 0.9981 1.0046 0.9995 0.9970 1.0019 0.9955
dispcorr: -0.030860547 hartree
energy: -1805.246071928751
dipole: -32.03055 30.25502 -1.77553 -41.82692 40.68743 -1.13949 -21.96064 21.17359 -0.78705
magnitude: 2.25175 au
magnitude: 5.72349 debye
