program: Orca
programVersion: 5.0.2
elementType: Cl F O O O O O N C C C C C C C C C C C C C C C C C C C C C H H H H H H H H H H H H H H H H H H H H H H H
charge: 0
multiplicity: 1
keywords: wb97x-d3
keywords: def2-TZVPP
keywords: def2/J RIJCOSX
keywords: DEFGRID2
keywords: scfconv7
keywords: smallprint printgap noloewdin
keywords: NOSOSCF
formula: C21H23ClFNO5
InChI: InChI=1/C21H23ClFNO5/c1-2-3-6-9-28-19(25)12-29-18-11-17(16(23)10-15(18)22)24-20(26)13-7-4-5-8-14(13)21(24)27/h10-11H,2-9,12H2,1H3
52 atoms
Cl 3.828929 1.295118 -2.15066
F  -0.97826 2.650911 -1.566099
O  -2.299945 -1.45355 -2.132212
O  -1.908257 1.651572 1.165519
O  2.834125 -1.237751 -1.29613
O  2.840703 -1.5792 1.30524
O  1.788954 -3.551515 1.189333
N  -1.747191 0.194395 -0.61559
C  -6.272222 -0.902223 0.033484
C  -5.89939 -0.496472 1.458821
C  -5.082016 -1.493166 -0.725062
C  -4.818521 0.58553 1.479162
C  -3.870739 -0.680411 -0.45799
C  -3.758241 0.238056 0.502386
C  -2.590023 -0.747337 -1.203616
C  -2.395945 0.820808 0.445483
C  -0.421113 0.442464 -1.00119
C  0.534425 -0.564799 -0.926832
C  -0.053369 1.693281 -1.459622
C  1.848035 -0.3239 -1.304913
C  3.14022 1.0360 2.506174
C  1.251764 1.970861 -1.809308
C  3.413727 -0.281101 3.227766
C  2.193036 0.962994 -1.729101
C  1.676535 1.457194 2.458696
C  2.635303 -1.476638 2.725636
C  1.506777 2.854077 1.878797
C  2.560749 -2.533788 -0.827512
C  2.339832 -2.613836 0.670373
H  -7.087824 -1.626452 0.051525
H  -6.643558 -0.026611 -0.506643
H  -6.783105 -0.140796 1.990337
H  -5.538424 -1.373863 2.003226
H  -4.896349 -2.526581 -0.414573
H  -5.284071 -1.534541 -1.79812
H  -5.240766 1.562242 1.22127
H  -4.39319 0.696686 2.479478
H  0.214688 -1.533112 -0.56517
H  3.537022 0.993236 1.487374
H  3.717688 1.815368 3.012811
H  3.169077 -0.180193 4.289286
H  4.483522 -0.502364 3.18323
H  1.526729 2.961441 -2.146484
H  1.0977 0.747501 1.86024
H  1.24953 1.425102 3.466405
H  2.980069 -2.388082 3.218145
H  1.565122 -1.37438 2.919617
H  0.456497 3.137821 1.808704
H  2.007164 3.60229 2.497269
H  1.93333 2.921949 0.876089
H  3.442081 -3.133253 -1.067547
H  1.712369 -2.99565 -1.340891
elementType: Cl F O N C H
totalener: -1805.21664329 hartree
nucrepener: 3119.23035354 hartree
electener: -4924.44699683 hartree
oneelecener: -8676.72481756 hartree
twoeener: 3752.27782073 hartree
cpcmener: -0.03607003 hartree
kineticenergy: 1798.95650762 hartree
xcener: -147.728876837175 hartree
chargesum: -0.0000000
charge: -0.072631 -0.210542 -0.400663 -0.413940 -0.305396 -0.258006 -0.450276 -0.035833 -0.136265 -0.136451 -0.073910 -0.072794 -0.087058 -0.030669 0.322749 0.302814 -0.026023 -0.161538 0.207153 0.272572 -0.094835 -0.139642 -0.142050 0.015291 -0.100091 -0.015181 -0.302871 0.015905 0.373397 0.080907 0.078262 0.081355 0.078762 0.101243 0.094870 0.101136 0.093171 0.136738 0.056500 0.077015 0.073073 0.081550 0.134508 0.040967 0.074405 0.119852 0.116261 0.092168 0.096900 0.078022 0.140722 0.128395
qa: -0.0726 -0.2105 -0.4007 -0.4139 -0.3054 -0.2580 -0.4503 -0.0358 -0.1363 -0.1365 -0.0739 -0.0728 -0.0871 -0.0307 0.3227 0.3028 -0.0260 -0.1615 0.2072 0.2726 -0.0948 -0.1396 -0.1420 0.0153 -0.1001 -0.0152 -0.3029 0.0159 0.3734 0.0809 0.0783 0.0814 0.0788 0.1012 0.0949 0.1011 0.0932 0.1367 0.0565 0.0770 0.0731 0.0815 0.1345 0.0410 0.0744 0.1199 0.1163 0.0922 0.0969 0.0780 0.1407 0.1284
va: 1.2349 1.0838 2.1194 2.1002 2.0983 2.1430 2.0605 3.0388 3.9154 3.9150 3.9177 3.9167 3.7134 3.7077 4.1793 4.1698 3.6836 3.8860 4.0808 3.8805 3.8368 3.9433 3.9634 3.8163 3.8561 3.8170 3.9438 3.9127 4.0897 1.0093 1.0066 1.0095 1.0068 1.0047 1.0148 1.0046 1.0161 1.0325 1.0202 1.0111 1.0132 1.0124 1.0167 1.0120 1.0099 1.0062 0.9928 1.0131 1.0057 0.9941 0.9896 1.0031
dispcorr: -0.031014509 hartree
energy: -1805.247657802413
dipole: -15.58601 14.22772 -1.35829 -3.79787 3.40520 -0.39268 31.59358 -30.60839 0.98519
magnitude: 1.72330 au
magnitude: 4.38027 debye
