program: Orca
programVersion: 5.0.2
elementType: Cl F O O O O O N C C C C C C C C C C C C C C C C C C C C C H H H H H H H H H H H H H H H H H H H H H H H
charge: 0
multiplicity: 1
keywords: wb97x-d3
keywords: def2-TZVPP
keywords: def2/J RIJCOSX
keywords: DEFGRID2
keywords: scfconv7
keywords: smallprint printgap noloewdin
keywords: NOSOSCF
formula: C21H23ClFNO5
InChI: InChI=1/C21H23ClFNO5/c1-2-3-6-9-28-19(25)12-29-18-11-17(16(23)10-15(18)22)24-20(26)13-7-4-5-8-14(13)21(24)27/h10-11H,2-9,12H2,1H3
52 atoms
Cl 3.93799 1.894074 1.882398
F  -0.791996 0.762557 3.169943
O  -1.321172 -1.158276 -0.66007
O  -2.786839 2.488808 1.626799
O  2.838506 1.842294 -0.751473
O  2.464655 -0.543406 -1.809238
O  1.579963 0.273846 -3.695704
N  -1.686955 0.758905 0.571273
C  -5.868944 -1.079774 -0.525941
C  -6.256577 0.396706 -0.453485
C  -4.419762 -1.269307 -0.977497
C  -5.403113 1.164653 0.557932
C  -3.550942 -0.296975 -0.270155
C  -3.982022 0.766497 0.409704
C  -2.071146 -0.344832 -0.18814
C  -2.808499 1.4816 0.970592
C  -0.357438 1.075111 0.886947
C  0.547214 1.367314 -0.125302
C  0.076385 1.05615 2.199072
C  1.884573 1.598261 0.164134
C  1.941411 -4.20157 -1.199121
C  1.389999 1.325855 2.52134
C  2.442717 -2.778689 -0.97545
C  2.287236 1.585901 1.502185
C  2.362177 -5.179434 -0.105981
C  2.049891 -1.884753 -2.129058
C  3.856073 -5.469414 -0.077909
C  2.503775 1.798029 -2.115657
C  2.124975 0.422831 -2.631281
H  -6.000899 -1.537893 0.458532
H  -6.535885 -1.608718 -1.208197
H  -6.138308 0.851345 -1.441389
H  -7.310636 0.494547 -0.189897
H  -4.080974 -2.290965 -0.789438
H  -4.326209 -1.116101 -2.057685
H  -5.512775 2.243455 0.423788
H  -5.7302 0.954344 1.581528
H  0.168717 1.409344 -1.138086
H  2.295337 -4.572328 -2.167467
H  0.849164 -4.183404 -1.26159
H  3.529913 -2.766713 -0.862661
H  2.017157 -2.386365 -0.046795
H  1.711355 1.311321 3.554388
H  2.042499 -4.795807 0.867945
H  1.822361 -6.11871 -0.252574
H  2.532805 -2.204587 -3.055385
H  0.969172 -1.898745 -2.286725
H  4.446677 -4.58074 0.149875
H  4.097791 -6.217513 0.678813
H  4.200394 -5.855857 -1.039779
H  3.395903 2.124618 -2.654798
H  1.703691 2.49959 -2.370604
elementType: Cl F O N C H
totalener: -1805.21649017 hartree
nucrepener: 3025.58290713 hartree
electener: -4830.79939730 hartree
oneelecener: -8489.47026413 hartree
twoeener: 3658.67086683 hartree
cpcmener: -0.03577655 hartree
kineticenergy: 1798.95532418 hartree
xcener: -147.726542652271 hartree
chargesum: -0.0000000
charge: -0.070421 -0.209589 -0.415744 -0.398863 -0.309420 -0.258373 -0.450174 -0.059187 -0.135190 -0.136157 -0.073037 -0.073547 -0.044610 -0.087106 0.310708 0.334509 -0.000534 -0.190739 0.192996 0.303117 -0.125552 -0.116710 -0.095332 -0.009675 -0.110342 -0.015295 -0.271967 0.018108 0.372278 0.078483 0.081051 0.077903 0.081198 0.093805 0.101324 0.093541 0.101542 0.135412 0.065381 0.077536 0.076133 0.065530 0.133933 0.054982 0.069777 0.119392 0.101122 0.078638 0.090321 0.078510 0.140865 0.129473
qa: -0.0704 -0.2096 -0.4157 -0.3989 -0.3094 -0.2584 -0.4502 -0.0592 -0.1352 -0.1362 -0.0730 -0.0735 -0.0446 -0.0871 0.3107 0.3345 -0.0005 -0.1907 0.1930 0.3031 -0.1256 -0.1167 -0.0953 -0.0097 -0.1103 -0.0153 -0.2720 0.0181 0.3723 0.0785 0.0811 0.0779 0.0812 0.0938 0.1013 0.0935 0.1015 0.1354 0.0654 0.0775 0.0761 0.0655 0.1339 0.0550 0.0698 0.1194 0.1011 0.0786 0.0903 0.0785 0.1409 0.1295
va: 1.2401 1.0854 2.0955 2.1239 2.1008 2.1521 2.0612 3.0492 3.9147 3.9152 3.9167 3.9166 3.6983 3.7088 4.1594 4.1897 3.6655 3.9111 4.1313 3.8595 3.9044 3.9845 3.8983 3.8972 3.9064 3.8365 3.9293 3.9059 4.0990 1.0065 1.0095 1.0067 1.0093 1.0157 1.0046 1.0155 1.0043 1.0286 1.0091 1.0119 1.0139 1.0156 1.0147 1.0079 1.0058 1.0019 1.0065 0.9991 1.0043 1.0008 0.9905 1.0015
dispcorr: -0.026694207 hartree
energy: -1805.243184376535
dipole: -13.77561 12.20110 -1.57451 -40.79774 39.86081 -0.93693 -19.91035 19.33555 -0.57480
magnitude: 1.92024 au
magnitude: 4.88086 debye
