program: Orca
programVersion: 5.0.2
elementType: Cl F O O O O O N C C C C C C C C C C C C C C C C C C C C C H H H H H H H H H H H H H H H H H H H H H H H
charge: 0
multiplicity: 1
keywords: wb97x-d3
keywords: def2-TZVPP
keywords: def2/J RIJCOSX
keywords: DEFGRID2
keywords: scfconv7
keywords: smallprint printgap noloewdin
keywords: NOSOSCF
formula: C21H23ClFNO5
InChI: InChI=1/C21H23ClFNO5/c1-2-3-6-9-28-19(25)12-29-18-11-17(16(23)10-15(18)22)24-20(26)13-7-4-5-8-14(13)21(24)27/h10-11H,2-9,12H2,1H3
52 atoms
Cl 3.863841 -0.478542 -2.320073
F  -0.927524 1.007118 -2.653185
O  -2.812421 -1.285446 -2.284221
O  -1.363128 0.427067 1.670739
O  2.886211 -1.854956 -0.01404
O  2.65212 -0.089142 1.907473
O  1.982897 -1.590288 3.428048
N  -1.719566 -0.426912 -0.443704
C  -6.269374 -0.864125 0.648763
C  -5.910916 0.317385 1.549065
C  -5.427574 -0.886899 -0.628693
C  -4.454219 0.26262 2.01261
C  -4.01134 -0.599781 -0.293738
C  -3.584275 -0.104216 0.868356
C  -2.837842 -0.829572 -1.172638
C  -2.107706 0.021247 0.817461
C  -0.395039 -0.466768 -0.905296
C  0.562307 -1.209837 -0.226574
C  -0.019164 0.260401 -2.020575
C  1.887044 -1.206042 -0.639658
C  1.667985 2.465383 0.775373
C  1.278949 0.239593 -2.484893
C  2.593589 2.294009 1.975437
C  2.226615 -0.485698 -1.786896
C  1.880215 3.767681 0.01025
C  2.343936 1.028063 2.763142
C  3.23916 3.871583 -0.668383
C  2.663241 -2.362524 1.277516
C  2.383119 -1.303246 2.328271
H  -6.114838 -1.797585 1.197504
H  -7.327778 -0.827584 0.387234
H  -6.079663 1.251087 1.004967
H  -6.569625 0.339161 2.418318
H  -5.510687 -1.851422 -1.135311
H  -5.786488 -0.139834 -1.344198
H  -4.141869 1.219743 2.436908
H  -4.328354 -0.475442 2.811578
H  0.241278 -1.787833 0.630102
H  0.631351 2.419393 1.121358
H  1.795997 1.629737 0.08171
H  2.45193 3.128786 2.668629
H  3.643146 2.326072 1.6706
H  1.55154 0.810096 -3.362987
H  1.097975 3.852022 -0.749298
H  1.738946 4.61881 0.683971
H  2.975341 0.98621 3.652873
H  1.300069 0.962116 3.07945
H  3.30703 4.773329 -1.278991
H  4.058679 3.908678 0.050704
H  3.41819 3.017312 -1.325702
H  3.581957 -2.881954 1.559034
H  1.861057 -3.106287 1.305034
elementType: Cl F O N C H
totalener: -1805.21626869 hartree
nucrepener: 3124.90328635 hartree
electener: -4930.11955504 hartree
oneelecener: -8688.22498138 hartree
twoeener: 3758.10542634 hartree
cpcmener: -0.03616915 hartree
kineticenergy: 1798.95158866 hartree
xcener: -147.729316107619 hartree
chargesum: -0.0000000
charge: -0.073157 -0.210717 -0.397491 -0.417051 -0.312464 -0.254143 -0.450680 -0.042400 -0.135603 -0.135836 -0.074890 -0.072999 -0.096108 -0.018119 0.335532 0.289101 -0.012439 -0.176896 0.214355 0.259645 -0.037810 -0.141776 -0.118967 0.045586 -0.114080 -0.021661 -0.268469 0.019984 0.372365 0.077798 0.081127 0.078287 0.081350 0.093804 0.101015 0.094346 0.101145 0.140474 0.074250 -0.023672 0.072099 0.074202 0.131505 0.069944 0.061586 0.122131 0.105360 0.092002 0.080753 0.069664 0.141491 0.126526
qa: -0.0732 -0.2107 -0.3975 -0.4171 -0.3125 -0.2541 -0.4507 -0.0424 -0.1356 -0.1358 -0.0749 -0.0730 -0.0961 -0.0181 0.3355 0.2891 -0.0124 -0.1769 0.2144 0.2596 -0.0378 -0.1418 -0.1190 0.0456 -0.1141 -0.0217 -0.2685 0.0200 0.3724 0.0778 0.0811 0.0783 0.0813 0.0938 0.1010 0.0943 0.1011 0.1405 0.0742 -0.0237 0.0721 0.0742 0.1315 0.0699 0.0616 0.1221 0.1054 0.0920 0.0808 0.0697 0.1415 0.1265
va: 1.2354 1.0824 2.1253 2.0906 2.1000 2.1465 2.0624 3.0461 3.9152 3.9151 3.9175 3.9159 3.7234 3.6988 4.1847 4.1610 3.6651 3.8816 4.0672 3.8963 3.8481 3.9662 3.9389 3.8098 3.9093 3.8635 3.9330 3.9110 4.1070 1.0068 1.0094 1.0066 1.0094 1.0156 1.0045 1.0155 1.0050 1.0234 1.0233 1.0552 1.0151 1.0128 1.0167 1.0065 1.0086 1.0009 1.0063 1.0055 0.9986 1.0025 0.9913 1.0003
dispcorr: -0.030832613 hartree
energy: -1805.247101304072
dipole: -15.22793 13.59201 -1.63593 20.67807 -20.29336 0.38471 21.90732 -21.06194 0.84538
magnitude: 1.88120 au
magnitude: 4.78163 debye
