program: Gaussian 09
title: 000056535
version: EM64L-G09RevD.01
frameworkgroup: C1[X(C12H17NO3)]
method: RPBEPBE
basis: SDD
operation: Freq
keyword: #p
keyword: freq=noraman
keyword: PBEPBE/SDD
title: #p freq=noraman PBEPBE/SDD
converged: YES YES NO NO
title: Mulliken charges:
elementType: O O O N C C C C C C C C C C C C H H H H H H H H H H H H H H H H H
charge: -0.295256 -0.257941 -0.261309 -0.303479 -0.373209 -0.253884 0.216739 0.347919 -0.326943 -0.341791 -0.363331 -0.341116 0.182897 -0.247256 -0.621678 -0.683105 0.198739 0.219653 0.245747 0.216731 0.271063 0.266743 0.254925 0.246685 0.256986 0.212130 0.211804 0.192432 0.224153 0.228239 0.209096 0.233715 0.233903
chargesum: 0.00000
title: Mulliken charges with hydrogens summed into heavy atoms:
elementType: O O O N C C C C C C C C C C C C
charge: -0.295256 -0.257941 -0.261309 -0.046493 0.045182 0.208593 0.216739 0.347919 -0.055880 -0.075048 -0.108406 -0.094431 0.182897 0.176678 0.023146 -0.006391
polarizability: 2.44063765e+02 -1.30371660e+01 1.48952523e+02 -1.01928555e+00 -1.86872305e+00 8.47224669e+01
1716.lowfreq: -7.5422 -0.0008 0.0003 0.0007 6.2120 8.6936 22.4774 41.5688 45.5292
frequency: 21.8192 41.5309 45.5077 61.4005 67.0037 94.8644 111.5389 119.6361 127.3795 172.4819 182.6007 217.4116 234.1427 244.4067 270.1526 307.8191 311.7293 391.2531 418.1263 421.8646 453.4337 507.1250 515.3162 621.0105 634.3553 661.8935 677.3038 755.5273 757.5111 802.2267 812.8469 814.0523 836.5407 855.9319 900.9677 920.2219 969.6451 970.2506 991.4938 1000.5990 1032.9775 1044.2828 1060.1109 1085.0581 1114.8725 1119.6242 1121.1691 1134.7483 1156.1532 1170.2490 1173.5744 1217.8302 1230.0150 1249.5178 1262.7057 1264.6881 1299.3489 1320.3581 1364.7175 1381.9799 1386.1283 1401.2507 1429.8001 1437.7018 1454.7710 1461.6112 1468.0461 1474.6455 1475.6614 1486.0983 1488.7217 1498.0240 1499.4347 1571.7745 1617.0146 1621.1698 2875.4130 2884.4070 2960.5211 2998.1282 3003.6427 3016.7485 3020.6346 3027.7141 3078.4516 3082.5306 3095.3252 3107.7148 3152.9634 3156.6805 3173.2008 3178.9007 3454.0764
redmass: 3.1076 2.4903 4.2113 2.4736 5.0392 2.9531 3.1196 2.2814 3.2324 4.0337 2.5487 3.7561 1.6456 1.2039 3.9226 6.4539 3.9010 3.6692 2.9885 3.5100 5.4975 2.9507 5.5934 6.1648 6.0715 1.3517 4.1282 4.5444 4.8829 1.9211 1.7700 1.2841 1.1651 1.6295 3.5128 6.9552 2.0903 1.4190 1.3433 3.0194 2.7758 1.5559 3.9219 2.1236 1.9177 1.4609 1.5789 1.4395 1.6140 2.1166 1.4431 1.5090 3.1183 3.4368 1.1205 1.1399 1.2839 1.3709 1.4928 3.2944 1.5150 1.3039 4.2916 1.1534 1.1840 1.0395 1.0844 1.0814 1.1019 1.1728 1.0643 1.0669 2.0435 8.0537 9.7767 6.8913 1.0596 1.0669 1.0554 1.0363 1.0609 1.0757 1.1078 1.0867 1.0995 1.1061 1.0988 1.1015 1.0883 1.0877 1.0967 1.0966 1.0745
irintensity: 0.3554 0.7553 0.3698 1.1423 0.4138 3.5758 0.7965 1.4649 1.8321 4.5224 3.2636 1.8855 2.9427 1.6263 15.1807 0.0893 0.4036 8.1080 0.0617 15.9318 1.5496 8.6732 3.2676 14.6258 26.9050 106.7319 29.6630 16.3907 7.8904 3.1857 4.0146 14.2911 0.1029 52.9486 46.9018 20.8100 1.3594 0.4123 0.1563 43.5237 105.7288 18.8598 346.6810 37.7097 1.9326 11.8374 0.4260 4.6626 24.8376 165.4126 134.0109 8.7681 148.7272 460.3025 9.0104 0.0255 0.4327 16.8074 8.2552 3.9847 12.7324 29.9868 23.6949 2.0729 18.7504 12.2656 7.7429 12.2867 26.2141 24.4317 19.0115 11.3147 47.7453 61.0746 108.1600 312.7512 95.4583 146.0223 35.3696 26.1620 21.1130 53.0139 33.0646 20.6156 39.2879 35.2883 27.3602 33.8011 0.6154 9.0437 7.9007 5.6431 0.6564
temp: 298.150 k
press: 1.00000 atm
elementType: 8 8 8 7 6 6 6 6 6 6 6 6 6 6 6 6 1 1 1 1 1 1 1 1 1 1 1 1 1 1 1 1 1
symmnumber: 1
zpe: 712757.9 jmol-1
zpe.correction: 0.271475 hartree
zpe.thermalcorrener: 0.288756 hartree
zpe.thermalcorrenthalpy: 0.289700 hartree
zpe.thermalcorrgfe: 0.224060 hartree
zpe.sumelectzpe: -746.659488 hartree
zpe.sumelectthermal: -746.642208 hartree
zpe.sumelectthermalent: -746.641263 hartree
zpe.sumelectthermalfe: -746.706903 hartree
dipole: 1.3919 -4.4266 -0.9036
dipole: 4.7274
quadrupole: -73.9498 -94.9683 -97.0156
quadrupole: -0.9039 6.1699 -1.0516
quadrupole: 14.6947 -6.3237 -8.3711 -0.9039 6.1699 -1.0516
hfenergy: -746.9309634 hartree
pointgroup: C01 [X(C12H17N1O3)]
dipole: 0.5520474 -1.7432566 -0.3399686 debye
polarizability: 243.9163983|-13.2676897|149.031922|3.4330655|-2.2464963|84.790435 unknown
InChI: InChI=1S/C12H17NO3/c1-3-15-11-6-4-10(5-7-11)12(14)16-9-8-13-2/h4-7,13H,3,8-9H2,1-2H3
charge 0 multiplicity 1
33 atoms
O  -2.087681 0.070894 0.061706
O  4.3343 -0.164953 0.148616
O  -1.628354 2.357154 0.020326
N  -5.73364 -0.664684 -0.174591
C  -4.282665 -0.927877 -0.119723
C  -3.537872 0.399155 0.052236
C  0.21042 0.75464 0.077957
C  2.956746 0.063525 0.126463
C  1.209432 1.768268 0.064028
C  0.60664 -0.605616 0.116704
C  2.569072 1.429993 0.087679
C  1.970425 -0.958782 0.141051
C  -1.214346 1.169657 0.051285
C  4.811858 -1.564945 0.192491
C  -6.585416 -1.865704 -0.104125
C  6.336456 -1.508457 0.20924
H  -3.882918 -1.461829 -1.016674
H  -4.080441 -1.573147 0.755789
H  -3.810455 0.892097 1.001225
H  -3.740003 1.105009 -0.776012
H  0.891555 2.815506 0.034726
H  -0.162765 -1.382603 0.128219
H  3.350422 2.195501 0.077674
H  2.251561 -2.015205 0.171389
H  -5.983448 -0.057273 -0.965762
H  4.415174 -2.058083 1.103199
H  4.436539 -2.107305 -0.699056
H  -6.385121 -2.622954 -0.9014
H  -7.647351 -1.570282 -0.170474
H  -6.439513 -2.364135 0.872146
H  6.753294 -2.531394 0.243501
H  6.717808 -1.004988 -0.695213
H  6.695987 -0.954284 1.092782
