program: Orca
programVersion: 5.0.2
elementType: Cl F O O O O O N C C C C C C C C C C C C C C C C C C C C C H H H H H H H H H H H H H H H H H H H H H H H
charge: 0
multiplicity: 1
keywords: wb97x-d3
keywords: def2-TZVPP
keywords: def2/J RIJCOSX
keywords: DEFGRID2
keywords: scfconv7
keywords: smallprint printgap noloewdin
keywords: NOSOSCF
formula: C21H23ClFNO5
InChI: InChI=1/C21H23ClFNO5/c1-2-3-6-9-28-19(25)12-29-18-11-17(16(23)10-15(18)22)24-20(26)13-7-4-5-8-14(13)21(24)27/h10-11H,2-9,12H2,1H3
52 atoms
Cl 3.854271 -2.579641 -0.04947
F  -0.842429 -2.195214 -1.805522
O  -2.870095 -2.554673 0.335062
O  -1.210935 1.675982 0.269061
O  2.819855 -0.852138 2.001924
O  3.424076 1.195234 0.478889
O  2.686579 2.709016 1.96034
N  -1.677681 -0.582017 0.254192
C  -6.237296 0.505038 0.61417
C  -5.738775 1.725519 -0.158599
C  -5.412843 -0.745826 0.303128
C  -4.298906 2.083136 0.212251
C  -3.971892 -0.396594 0.281774
C  -3.484267 0.844407 0.256727
C  -2.837888 -1.35418 0.289366
C  -2.004643 0.771942 0.260537
C  -0.367532 -1.078415 0.202154
C  0.557413 -0.725825 1.175087
C  0.032093 -1.892678 -0.843195
C  1.869311 -1.167025 1.097825
C  1.824552 1.475052 -2.041044
C  1.317681 -2.385029 -0.919051
C  2.54207 2.622639 -1.333512
C  2.233583 -2.009603 0.047398
C  1.005252 1.926335 -3.248202
C  3.73903 2.192432 -0.511169
C  -0.075011 2.952245 -2.937942
C  2.761588 0.417614 2.605208
C  2.931505 1.574342 1.638196
H  -6.185848 0.712122 1.686866
H  -7.286348 0.316588 0.382594
H  -5.792527 1.521587 -1.231923
H  -6.388604 2.581032 0.029912
H  -5.602992 -1.532802 1.036801
H  -5.694714 -1.166235 -0.667728
H  -3.873787 2.790658 -0.503826
H  -4.258946 2.580215 1.186884
H  0.228462 -0.105192 1.99742
H  1.175888 0.951325 -1.333011
H  2.560595 0.739448 -2.381129
H  1.844275 3.195431 -0.71883
H  2.937388 3.324196 -2.07637
H  1.607103 -3.026522 -1.740913
H  1.683637 2.337393 -4.002668
H  0.543124 1.047246 -3.70588
H  4.477698 1.706258 -1.148457
H  4.220203 3.048438 -0.034503
H  -0.787168 2.576791 -2.202245
H  0.341012 3.88168 -2.545754
H  -0.639549 3.207617 -3.836206
H  3.596005 0.455767 3.30976
H  1.852848 0.574539 3.191972
elementType: Cl F O N C H
totalener: -1805.21285656 hartree
nucrepener: 3131.05244892 hartree
electener: -4936.26530548 hartree
oneelecener: -8700.74061700 hartree
twoeener: 3764.47531152 hartree
cpcmener: -0.03693082 hartree
kineticenergy: 1798.96614180 hartree
xcener: -147.730751996763 hartree
chargesum: -0.0000000
charge: -0.070146 -0.209548 -0.397207 -0.411356 -0.323624 -0.260064 -0.453506 -0.024451 -0.136842 -0.132776 -0.072203 -0.079083 -0.082252 -0.023465 0.321987 0.282561 -0.001254 -0.139293 0.215765 0.208595 -0.060459 -0.135415 -0.126299 0.021764 -0.102155 -0.025663 -0.271218 0.011324 0.394848 0.078276 0.080687 0.078296 0.080686 0.094263 0.101203 0.093990 0.101693 0.147493 -0.007138 0.077737 0.081887 0.082651 0.134521 0.059650 0.064238 0.112490 0.113073 0.070284 0.082764 0.092905 0.140439 0.119345
qa: -0.0701 -0.2095 -0.3972 -0.4114 -0.3236 -0.2601 -0.4535 -0.0245 -0.1368 -0.1328 -0.0722 -0.0791 -0.0823 -0.0235 0.3220 0.2826 -0.0013 -0.1393 0.2158 0.2086 -0.0605 -0.1354 -0.1263 0.0218 -0.1022 -0.0257 -0.2712 0.0113 0.3948 0.0783 0.0807 0.0783 0.0807 0.0943 0.1012 0.0940 0.1017 0.1475 -0.0071 0.0777 0.0819 0.0827 0.1345 0.0597 0.0642 0.1125 0.1131 0.0703 0.0828 0.0929 0.1404 0.1193
va: 1.2397 1.0827 2.1255 2.0952 2.0861 2.1305 2.0564 3.0461 3.9171 3.9120 3.9159 3.9227 3.7071 3.7099 4.1973 4.1607 3.6211 3.8683 4.0595 3.9367 3.8378 3.9929 3.8336 3.8725 3.9062 3.8871 3.9333 3.9330 4.0934 1.0066 1.0095 1.0070 1.0097 1.0150 1.0046 1.0143 1.0050 1.0131 1.0456 1.0118 1.0196 1.0136 1.0154 1.0080 1.0087 0.9986 1.0107 1.0089 0.9991 1.0062 0.9916 1.0025
dispcorr: -0.030959799 hartree
energy: -1805.243816362926
dipole: -22.18629 20.70827 -1.47802 34.66272 -33.78175 0.88098 -12.39259 12.19160 -0.20099
magnitude: 1.73236 au
magnitude: 4.40330 debye
