program: Orca
programVersion: 5.0.2
elementType: Cl F O O O O O N C C C C C C C C C C C C C C C C C C C C C H H H H H H H H H H H H H H H H H H H H H H H
charge: 0
multiplicity: 1
keywords: wb97x-d3
keywords: def2-TZVPP
keywords: def2/J RIJCOSX
keywords: DEFGRID2
keywords: scfconv7
keywords: smallprint printgap noloewdin
keywords: NOSOSCF
formula: C21H23ClFNO5
InChI: InChI=1/C21H23ClFNO5/c1-2-3-6-9-28-19(25)12-29-18-11-17(16(23)10-15(18)22)24-20(26)13-7-4-5-8-14(13)21(24)27/h10-11H,2-9,12H2,1H3
52 atoms
Cl 3.985694 2.012644 0.406737
F  -0.742991 2.440668 -1.250664
O  -1.529333 -1.677527 -0.247876
O  -2.642825 2.523327 1.085076
O  2.817151 -0.046582 2.04413
O  3.375275 -1.680084 0.063467
O  2.33241 -3.416404 1.026449
N  -1.710145 0.51767 0.433619
C  -6.03851 -1.068636 -0.454816
C  -6.368208 -0.061534 0.646498
C  -4.648812 -1.682127 -0.273366
C  -5.393019 1.116862 0.65549
C  -3.682248 -0.616173 0.086183
C  -4.00869 0.614969 0.481539
C  -2.203625 -0.726763 0.04967
C  -2.763184 1.385833 0.715372
C  -0.352775 0.870259 0.444592
C  0.543915 0.221599 1.281424
C  0.111603 1.859523 -0.40517
C  1.891343 0.552192 1.265164
C  1.96007 -0.87157 -2.38299
C  1.434844 2.244632 -0.405527
C  2.432153 -2.300835 -2.123347
C  2.3202 1.57993 0.424582
C  1.165292 -0.709289 -3.675068
C  3.60607 -2.386654 -1.16945
C  -0.099535 -1.552278 -3.741385
C  2.667286 -1.424061 2.294063
C  2.750116 -2.287028 1.049112
H  -6.78752 -1.86139 -0.472473
H  -6.086408 -0.570992 -1.427462
H  -7.386309 0.309443 0.521906
H  -6.334875 -0.563169 1.61767
H  -4.658063 -2.443169 0.513683
H  -4.326266 -2.194348 -1.182975
H  -5.624255 1.819302 -0.151883
H  -5.477751 1.68798 1.583107
H  0.16597 -0.538196 1.952806
H  2.825595 -0.202072 -2.422992
H  1.348657 -0.532121 -1.542492
H  2.775432 -2.756832 -3.057994
H  1.607418 -2.922031 -1.766901
H  1.77489 3.026605 -1.071608
H  0.898306 0.345346 -3.788352
H  1.808679 -0.951449 -4.526831
H  3.878412 -3.423012 -0.962242
H  4.476772 -1.891058 -1.598575
H  -0.655667 -1.35484 -4.659176
H  0.117676 -2.621555 -3.721249
H  -0.765013 -1.337141 -2.9037
H  1.74997 -1.66576 2.835836
H  3.498795 -1.705853 2.944938
elementType: Cl F O N C H
totalener: -1805.21272083 hartree
nucrepener: 3134.94802597 hartree
electener: -4940.16074680 hartree
oneelecener: -8708.52335889 hartree
twoeener: 3768.36261209 hartree
cpcmener: -0.03739720 hartree
kineticenergy: 1798.96309310 hartree
xcener: -147.729937615946 hartree
chargesum: -0.0000000
charge: -0.069918 -0.210954 -0.408469 -0.398448 -0.324046 -0.260178 -0.451381 -0.038875 -0.135648 -0.135803 -0.076641 -0.072893 -0.039205 -0.080939 0.295391 0.323332 0.023881 -0.146664 0.200859 0.211260 -0.044512 -0.128069 -0.127878 0.025495 -0.103561 -0.022234 -0.270831 0.011764 0.391386 0.080865 0.078878 0.080998 0.077787 0.101480 0.095115 0.101299 0.094126 0.148612 0.075928 -0.023624 0.082509 0.082100 0.133515 0.064631 0.062570 0.111128 0.111838 0.093401 0.083132 0.068899 0.118374 0.140217
qa: -0.0699 -0.2110 -0.4085 -0.3984 -0.3240 -0.2602 -0.4514 -0.0389 -0.1356 -0.1358 -0.0766 -0.0729 -0.0392 -0.0809 0.2954 0.3233 0.0239 -0.1467 0.2009 0.2113 -0.0445 -0.1281 -0.1279 0.0255 -0.1036 -0.0222 -0.2708 0.0118 0.3914 0.0809 0.0789 0.0810 0.0778 0.1015 0.0951 0.1013 0.0941 0.1486 0.0759 -0.0236 0.0825 0.0821 0.1335 0.0646 0.0626 0.1111 0.1118 0.0934 0.0831 0.0689 0.1184 0.1402
va: 1.2387 1.0786 2.0980 2.1241 2.0820 2.1346 2.0572 3.0382 3.9141 3.9168 3.9207 3.9161 3.7063 3.7047 4.1672 4.1962 3.6096 3.9108 4.0509 3.9414 3.8350 3.9795 3.8489 3.8565 3.8991 3.8883 3.9364 3.9263 4.0989 1.0096 1.0066 1.0095 1.0065 1.0050 1.0146 1.0046 1.0152 1.0114 1.0107 1.0539 1.0139 1.0174 1.0167 1.0082 1.0086 1.0123 0.9980 1.0064 0.9991 1.0049 1.0036 0.9911
dispcorr: -0.031369419 hartree
energy: -1805.244090249729
dipole: -23.34096 21.88473 -1.45622 -24.65001 24.06873 -0.58129 -19.97895 19.66196 -0.31699
magnitude: 1.59968 au
magnitude: 4.06605 debye
