program: Orca
programVersion: 5.0.2
elementType: Cl F O O O O O N C C C C C C C C C C C C C C C C C C C C C H H H H H H H H H H H H H H H H H H H H H H H
charge: 0
multiplicity: 1
keywords: wb97x-d3
keywords: def2-TZVPP
keywords: def2/J RIJCOSX
keywords: DEFGRID2
keywords: scfconv7
keywords: smallprint printgap noloewdin
keywords: NOSOSCF
formula: C21H23ClFNO5
InChI: InChI=1/C21H23ClFNO5/c1-2-3-6-9-28-19(25)12-29-18-11-17(16(23)10-15(18)22)24-20(26)13-7-4-5-8-14(13)21(24)27/h10-11H,2-9,12H2,1H3
52 atoms
Cl 3.858207 0.035156 2.974561
F  -1.002043 -1.252018 3.159597
O  -2.809737 1.122417 2.870793
O  -1.295989 -0.459385 -1.113654
O  2.973437 1.607513 0.764089
O  2.657705 0.379568 -1.559802
O  1.834757 2.207657 -2.555545
N  -1.687774 0.331048 1.01785
C  -6.204991 0.893394 -0.15197
C  -5.841407 -0.239672 -1.111157
C  -5.390884 0.836999 1.142236
C  -4.371974 -0.187478 -1.533641
C  -3.971307 0.548482 0.823688
C  -3.525148 0.101677 -0.350849
C  -2.815315 0.718131 1.739007
C  -2.053871 -0.062211 -0.268534
C  -0.374715 0.293439 1.509885
C  0.621699 1.041795 0.895651
C  -0.048133 -0.519592 2.579187
C  1.939469 0.952836 1.321353
C  2.191837 -2.889037 -3.344538
C  1.245456 -0.594177 3.052122
C  2.754811 -1.861668 -2.366588
C  2.23262 0.13463 2.415821
C  2.53732 -2.639375 -4.808778
C  2.266199 -0.460419 -2.663505
C  2.059236 -3.764348 -5.714614
C  2.73996 2.414737 -0.361941
C  2.350181 1.655675 -1.616304
H  -6.030366 1.854416 -0.644051
H  -7.26896 0.853686 0.085206
H  -6.042571 -1.201012 -0.629733
H  -6.476089 -0.195903 -1.997244
H  -5.474921 1.773589 1.69847
H  -5.773769 0.056714 1.808445
H  -4.065983 -1.126456 -2.000933
H  -4.211613 0.589597 -2.288292
H  0.330236 1.695441 0.083947
H  1.103355 -2.934946 -3.232601
H  2.566265 -3.874874 -3.053977
H  3.847987 -1.884217 -2.392361
H  2.453513 -2.13763 -1.352641
H  1.480911 -1.232461 3.893482
H  2.09191 -1.698582 -5.144687
H  3.620208 -2.51798 -4.913077
H  2.69876 -0.068827 -3.585253
H  1.177609 -0.436728 -2.758246
H  0.978077 -3.899782 -5.641385
H  2.293214 -3.564471 -6.761329
H  2.527292 -4.71464 -5.44952
H  3.683078 2.927886 -0.563397
H  1.991027 3.188881 -0.171485
elementType: Cl F O N C H
totalener: -1805.21656146 hartree
nucrepener: 3005.47317226 hartree
electener: -4810.68973372 hartree
oneelecener: -8449.27805134 hartree
twoeener: 3638.58831762 hartree
cpcmener: -0.03572954 hartree
kineticenergy: 1798.95127402 hartree
xcener: -147.725565751610 hartree
chargesum: 0.0000000
charge: -0.070759 -0.209542 -0.397544 -0.413895 -0.307448 -0.262077 -0.450031 -0.062036 -0.136026 -0.134840 -0.073147 -0.074831 -0.087498 -0.047768 0.333100 0.314055 -0.001570 -0.182502 0.191551 0.297854 -0.142009 -0.116571 -0.103583 -0.010120 -0.083088 -0.002324 -0.280192 0.017065 0.369821 0.078003 0.080980 0.077966 0.080882 0.093673 0.101402 0.094129 0.101602 0.136305 0.068440 0.072612 0.074441 0.077502 0.134548 0.059834 0.059022 0.112872 0.105304 0.078265 0.090019 0.079067 0.139965 0.129123
qa: -0.0708 -0.2095 -0.3975 -0.4139 -0.3074 -0.2621 -0.4500 -0.0620 -0.1360 -0.1348 -0.0731 -0.0748 -0.0875 -0.0478 0.3331 0.3141 -0.0016 -0.1825 0.1916 0.2979 -0.1420 -0.1166 -0.1036 -0.0101 -0.0831 -0.0023 -0.2802 0.0171 0.3698 0.0780 0.0810 0.0780 0.0809 0.0937 0.1014 0.0941 0.1016 0.1363 0.0684 0.0726 0.0744 0.0775 0.1345 0.0598 0.0590 0.1129 0.1053 0.0783 0.0900 0.0791 0.1400 0.1291
va: 1.2397 1.0857 2.1249 2.0962 2.1003 2.1557 2.0603 3.0565 3.9164 3.9153 3.9167 3.9173 3.7046 3.6976 4.1928 4.1599 3.6864 3.9069 4.1279 3.8706 3.9136 3.9838 3.9114 3.8965 3.8639 3.8219 3.9483 3.9059 4.0959 1.0066 1.0095 1.0066 1.0094 1.0158 1.0042 1.0157 1.0043 1.0300 1.0081 1.0099 1.0135 1.0151 1.0143 1.0065 1.0066 1.0015 0.9998 1.0005 1.0036 1.0015 0.9898 1.0024
dispcorr: -0.026234710 hartree
energy: -1805.242796173754
dipole: -15.71950 14.26979 -1.44971 -16.10373 15.81205 -0.29169 -49.30339 48.18091 -1.12248
magnitude: 1.85653 au
magnitude: 4.71893 debye
