program: Orca
programVersion: 5.0.2
elementType: Cl F O O O O O N C C C C C C C C C C C C C C C C C C C C C H H H H H H H H H H H H H H H H H H H H H H H
charge: 0
multiplicity: 1
keywords: wb97x-d3
keywords: def2-TZVPP
keywords: def2/J RIJCOSX
keywords: DEFGRID2
keywords: scfconv7
keywords: smallprint printgap noloewdin
keywords: NOSOSCF
formula: C21H23ClFNO5
InChI: InChI=1/C21H23ClFNO5/c1-2-3-6-9-28-19(25)12-29-18-11-17(16(23)10-15(18)22)24-20(26)13-7-4-5-8-14(13)21(24)27/h10-11H,2-9,12H2,1H3
52 atoms
Cl 3.595761 -2.490385 -0.893636
F  -1.322052 -2.219946 -1.916279
O  -2.916233 -2.658291 0.781353
O  -1.550453 1.589753 -0.085206
O  2.839143 -0.886419 1.34155
O  2.529386 1.60857 0.635699
O  2.019075 2.305701 2.701353
N  -1.877437 -0.664906 0.275337
C  -6.276858 0.310023 1.596642
C  -6.050491 1.466123 0.623543
C  -5.489408 -0.939398 1.196664
C  -4.583277 1.896583 0.575882
C  -4.115492 -0.551019 0.795571
C  -3.715347 0.694424 0.535614
C  -2.958234 -1.465893 0.633018
C  -2.270432 0.669064 0.198924
C  -0.577309 -1.128585 0.020344
C  0.465898 -0.788126 0.870553
C  -0.318999 -1.90511 -1.093608
C  1.764278 -1.193143 0.594564
C  3.906038 2.512453 -1.807737
C  0.955234 -2.35145 -1.374957
C  2.447072 2.769027 -1.44577
C  1.989959 -1.98311 -0.5355
C  4.153915 2.382872 -3.30763
C  2.195052 2.875833 0.040398
C  3.829887 3.637346 -4.106477
C  2.696562 0.042448 2.386141
C  2.365148 1.449254 1.927402
H  -5.975019 0.618766 2.601633
H  -7.339449 0.069319 1.650763
H  -6.369815 1.164043 -0.377973
H  -6.670878 2.318208 0.904784
H  -5.455997 -1.659475 2.017926
H  -5.976492 -1.45657 0.363619
H  -4.390572 2.533163 -0.290999
H  -4.325603 2.497973 1.453842
H  0.226451 -0.203681 1.749416
H  4.249025 1.596182 -1.320187
H  4.524267 3.32308 -1.406348
H  1.806329 1.989305 -1.870191
H  2.10782 3.712365 -1.881509
H  1.138234 -2.961119 -2.249819
H  5.204506 2.123171 -3.463115
H  3.575134 1.540022 -3.69842
H  2.805874 3.663212 0.488689
H  1.144817 3.098207 0.242092
H  4.11841 3.52186 -5.15246
H  2.764626 3.872592 -4.0929
H  4.363564 4.50651 -3.715301
H  3.662315 0.073213 2.895296
H  1.957369 -0.270968 3.129587
elementType: Cl F O N C H
totalener: -1805.21666703 hartree
nucrepener: 3035.78307236 hartree
electener: -4840.99973939 hartree
oneelecener: -8509.87946898 hartree
twoeener: 3668.87972959 hartree
cpcmener: -0.03624332 hartree
kineticenergy: 1798.96477471 hartree
xcener: -147.728271210045 hartree
chargesum: -0.0000000
charge: -0.071330 -0.210058 -0.400221 -0.413721 -0.311383 -0.257588 -0.452542 -0.062248 -0.135116 -0.135178 -0.074083 -0.073803 -0.084034 -0.049465 0.333519 0.314260 -0.006704 -0.175230 0.192000 0.288287 -0.106296 -0.117349 -0.119561 0.001507 -0.109593 -0.025700 -0.276843 0.016356 0.380052 0.077764 0.080985 0.077883 0.080931 0.094000 0.100791 0.094648 0.101452 0.135900 0.068866 0.065464 0.072576 0.077788 0.133568 0.069048 0.055668 0.114723 0.117710 0.090964 0.080632 0.079952 0.140687 0.130065
qa: -0.0713 -0.2101 -0.4002 -0.4137 -0.3114 -0.2576 -0.4525 -0.0622 -0.1351 -0.1352 -0.0741 -0.0738 -0.0840 -0.0495 0.3335 0.3143 -0.0067 -0.1752 0.1920 0.2883 -0.1063 -0.1173 -0.1196 0.0015 -0.1096 -0.0257 -0.2768 0.0164 0.3801 0.0778 0.0810 0.0779 0.0809 0.0940 0.1008 0.0946 0.1015 0.1359 0.0689 0.0655 0.0726 0.0778 0.1336 0.0690 0.0557 0.1147 0.1177 0.0910 0.0806 0.0800 0.1407 0.1301
va: 1.2389 1.0846 2.1222 2.0973 2.0967 2.1388 2.0625 3.0357 3.9147 3.9150 3.9173 3.9180 3.7062 3.7032 4.1894 4.1641 3.6541 3.9137 4.1374 3.8617 3.8527 3.9868 3.9253 3.8790 3.8981 3.8588 3.9315 3.9109 4.0893 1.0068 1.0096 1.0068 1.0094 1.0151 1.0047 1.0151 1.0047 1.0264 1.0276 1.0103 1.0157 1.0150 1.0151 1.0064 1.0093 1.0016 1.0057 1.0050 0.9974 0.9999 0.9916 1.0007
dispcorr: -0.027208124 hartree
energy: -1805.243875152835
dipole: -6.46540 5.02367 -1.44174 37.58941 -36.60624 0.98317 -7.74241 7.85799 0.11558
magnitude: 1.74888 au
magnitude: 4.44530 debye
