program: Orca
programVersion: 5.0.2
elementType: Cl F O O O O O N C C C C C C C C C C C C C C C C C C C C C H H H H H H H H H H H H H H H H H H H H H H H
charge: 0
multiplicity: 1
keywords: wb97x-d3
keywords: def2-TZVPP
keywords: def2/J RIJCOSX
keywords: DEFGRID2
keywords: scfconv7
keywords: smallprint printgap noloewdin
keywords: NOSOSCF
formula: C21H23ClFNO5
InChI: InChI=1/C21H23ClFNO5/c1-2-3-6-9-28-19(25)12-29-18-11-17(16(23)10-15(18)22)24-20(26)13-7-4-5-8-14(13)21(24)27/h10-11H,2-9,12H2,1H3
52 atoms
Cl 4.021186 2.911518 1.067062
F  -0.791307 3.543456 -0.221037
O  -1.643794 1.359496 -2.086651
O  -1.952035 0.15638 2.287352
O  3.18875 0.229295 1.466874
O  2.820685 -1.732274 -0.297813
O  3.555226 -3.257611 1.171482
N  -1.439054 0.902869 0.164639
C  -5.542881 -0.819841 -1.295405
C  -5.923941 -0.527619 0.155959
C  -4.522385 0.187895 -1.827275
C  -4.720044 -0.629733 1.094926
C  -3.459593 0.387293 -0.811564
C  -3.544685 0.022648 0.468143
C  -2.110471 0.954178 -1.055357
C  -2.260491 0.338298 1.139411
C  -0.133116 1.36956 0.381358
C  0.86619 0.502411 0.808107
C  0.169293 2.703519 0.172576
C  2.153501 0.968126 1.037541
C  0.530818 -3.461223 -1.166469
C  1.445267 3.187164 0.364315
C  1.994624 -3.790185 -1.437617
C  2.425933 2.319298 0.802824
C  -0.095307 -2.461313 -2.131007
C  2.954437 -2.614523 -1.429568
C  -1.603712 -2.368488 -1.953839
C  3.013887 -1.076653 1.957737
C  3.166367 -2.149918 0.899026
H  -5.118693 -1.826945 -1.365041
H  -6.432619 -0.809808 -1.927229
H  -6.346661 0.479188 0.221535
H  -6.70323 -1.215475 0.486528
H  -4.088807 -0.152945 -2.770251
H  -5.001894 1.14789 -2.045107
H  -4.939186 -0.176113 2.064816
H  -4.477243 -1.677945 1.301589
H  0.613333 -0.540825 0.941714
H  0.405848 -3.105969 -0.137866
H  -0.029053 -4.400002 -1.219025
H  2.085982 -4.233093 -2.434769
H  2.329092 -4.557317 -0.738245
H  1.662117 4.232947 0.191856
H  0.346808 -1.469959 -1.991465
H  0.131739 -2.755199 -3.160784
H  3.98767 -2.963303 -1.492856
H  2.775351 -1.961682 -2.282053
H  -2.084475 -3.329582 -2.149332
H  -1.864842 -2.076773 -0.934705
H  -2.043606 -1.6390 -2.635386
H  2.054373 -1.212233 2.470737
H  3.794235 -1.231531 2.703082
elementType: Cl F O N C H
totalener: -1805.21260236 hartree
nucrepener: 3107.05788183 hartree
electener: -4912.27048419 hartree
oneelecener: -8651.69723154 hartree
twoeener: 3739.42674735 hartree
cpcmener: -0.03674795 hartree
kineticenergy: 1798.95010955 hartree
xcener: -147.728310643429 hartree
chargesum: 0.0000000
charge: -0.071987 -0.209755 -0.399679 -0.401252 -0.309540 -0.268887 -0.449430 -0.026196 -0.130704 -0.138690 -0.097917 -0.064226 -0.077386 -0.072157 0.291178 0.320926 0.001260 -0.194849 0.181226 0.311189 -0.123869 -0.108427 -0.153541 -0.030078 -0.095687 -0.028212 -0.291335 0.038509 0.384522 0.078656 0.083509 0.077982 0.081294 0.098806 0.109138 0.096367 0.099872 0.137197 0.070653 0.078621 0.085753 0.089876 0.132257 0.059081 0.071773 0.123969 0.119554 0.099758 0.072055 0.090838 0.123597 0.134387
qa: -0.0720 -0.2098 -0.3997 -0.4013 -0.3095 -0.2689 -0.4494 -0.0262 -0.1307 -0.1387 -0.0979 -0.0642 -0.0774 -0.0722 0.2912 0.3209 0.0013 -0.1948 0.1812 0.3112 -0.1239 -0.1084 -0.1535 -0.0301 -0.0957 -0.0282 -0.2913 0.0385 0.3845 0.0787 0.0835 0.0780 0.0813 0.0988 0.1091 0.0964 0.0999 0.1372 0.0707 0.0786 0.0858 0.0899 0.1323 0.0591 0.0718 0.1240 0.1196 0.0998 0.0721 0.0908 0.1236 0.1344
va: 1.2399 1.0849 2.1071 2.1187 2.0957 2.1250 2.0569 3.0245 3.9012 3.9168 3.9160 3.9096 3.6503 3.6601 4.1392 4.1690 3.6618 3.9292 4.1355 3.8997 3.8598 3.9808 3.8630 3.8857 3.8576 3.8435 3.9493 3.8984 4.1386 1.0079 1.0101 1.0067 1.0095 1.0129 1.0046 1.0140 1.0064 1.0250 1.0111 1.0107 1.0133 1.0263 1.0158 1.0112 1.0088 1.0039 0.9920 1.0039 0.9959 1.0088 0.9970 1.0031
dispcorr: -0.031444387 hartree
energy: -1805.244046749766
dipole: -31.33420 29.16462 -2.16958 -41.06214 39.92451 -1.13762 -17.66838 16.95491 -0.71347
magnitude: 2.55153 au
magnitude: 6.48547 debye
