program: Orca
programVersion: 5.0.2
elementType: Cl F O O O O O N C C C C C C C C C C C C C C C C C C C C C H H H H H H H H H H H H H H H H H H H H H H H
charge: 0
multiplicity: 1
keywords: wb97x-d3
keywords: def2-TZVPP
keywords: def2/J RIJCOSX
keywords: DEFGRID2
keywords: scfconv7
keywords: smallprint printgap noloewdin
keywords: NOSOSCF
formula: C21H23ClFNO5
InChI: InChI=1/C21H23ClFNO5/c1-2-3-6-9-28-19(25)12-29-18-11-17(16(23)10-15(18)22)24-20(26)13-7-4-5-8-14(13)21(24)27/h10-11H,2-9,12H2,1H3
52 atoms
Cl 3.864602 2.515707 1.046054
F  -0.992666 3.138611 -0.109065
O  -2.723417 1.993523 2.224308
O  -1.392784 -1.014171 -0.912209
O  2.962457 -0.084135 1.810752
O  2.622227 -1.734467 -0.208255
O  1.841723 -3.387067 1.084364
N  -1.694975 0.614091 0.69183
C  -6.321227 -0.142179 0.417804
C  -5.820059 -1.533447 0.032262
C  -5.367651 0.559303 1.386794
C  -4.47047 -1.477171 -0.686118
C  -3.970045 0.366811 0.928305
C  -3.577694 -0.52119 0.013864
C  -2.782301 1.122257 1.398287
C  -2.111792 -0.393045 -0.17471
C  -0.373585 1.071983 0.806013
C  0.616067 0.239052 1.310078
C  -0.040566 2.347679 0.392195
C  1.934967 0.665234 1.372979
C  2.262731 -2.176214 -3.912337
C  1.25477 2.813126 0.479476
C  2.694893 -1.568934 -2.583452
C  2.235828 1.966427 0.961491
C  2.797428 -1.402451 -5.110751
C  2.22375 -2.407447 -1.417741
C  2.301824 -1.953515 -6.438489
C  2.728331 -1.433417 2.127848
C  2.338109 -2.298096 0.94338
H  -6.429224 0.467139 -0.484131
H  -7.312466 -0.212592 0.867573
H  -5.720767 -2.144412 0.933966
H  -6.551854 -2.032385 -0.604503
H  -5.599039 1.624474 1.462978
H  -5.474918 0.155111 2.398682
H  -4.008774 -2.466469 -0.730857
H  -4.596185 -1.157203 -1.725736
H  0.318669 -0.744368 1.649306
H  1.169211 -2.210185 -3.958484
H  2.603704 -3.215151 -3.973218
H  2.288947 -0.556969 -2.494572
H  3.785082 -1.481362 -2.553035
H  1.496038 3.817449 0.1572
H  2.50864 -0.350636 -5.022381
H  3.891428 -1.41981 -5.091694
H  1.13606 -2.513576 -1.422435
H  2.666392 -3.405452 -1.446572
H  1.214598 -1.887892 -6.515114
H  2.722884 -1.402564 -7.280959
H  2.576895 -3.002883 -6.563708
H  1.978106 -1.552721 2.915345
H  3.670528 -1.816214 2.525939
elementType: Cl F O N C H
totalener: -1805.21766828 hartree
nucrepener: 3007.60250991 hartree
electener: -4812.82017820 hartree
oneelecener: -8453.50582669 hartree
twoeener: 3640.68564849 hartree
cpcmener: -0.03587549 hartree
kineticenergy: 1798.96303466 hartree
xcener: -147.726508353227 hartree
chargesum: -0.0000000
charge: -0.069641 -0.210437 -0.398861 -0.414450 -0.308694 -0.257572 -0.449330 -0.063642 -0.135307 -0.135649 -0.074569 -0.073977 -0.081035 -0.051024 0.331226 0.316856 -0.008859 -0.175759 0.189947 0.295625 -0.128614 -0.116806 -0.083319 -0.002643 -0.083803 -0.004606 -0.277415 0.016682 0.373425 0.078378 0.080700 0.078182 0.081108 0.093622 0.101440 0.093993 0.101580 0.133371 0.065059 0.063680 0.067051 0.068336 0.133462 0.055752 0.057697 0.102637 0.111712 0.078408 0.089841 0.077452 0.128582 0.140207
qa: -0.0696 -0.2104 -0.3989 -0.4145 -0.3087 -0.2576 -0.4493 -0.0636 -0.1353 -0.1356 -0.0746 -0.0740 -0.0810 -0.0510 0.3312 0.3169 -0.0089 -0.1758 0.1899 0.2956 -0.1286 -0.1168 -0.0833 -0.0026 -0.0838 -0.0046 -0.2774 0.0167 0.3734 0.0784 0.0807 0.0782 0.0811 0.0936 0.1014 0.0940 0.1016 0.1334 0.0651 0.0637 0.0671 0.0683 0.1335 0.0558 0.0577 0.1026 0.1117 0.0784 0.0898 0.0775 0.1286 0.1402
va: 1.2409 1.0844 2.1236 2.0967 2.1013 2.1518 2.0616 3.0376 3.9150 3.9144 3.9167 3.9179 3.7033 3.6997 4.1874 4.1613 3.6664 3.9087 4.1380 3.8629 3.9067 3.9868 3.9193 3.8943 3.8835 3.8397 3.9454 3.9040 4.0963 1.0066 1.0097 1.0066 1.0094 1.0156 1.0047 1.0158 1.0050 1.0308 1.0082 1.0091 1.0144 1.0147 1.0150 1.0067 1.0065 1.0033 1.0039 1.0012 1.0041 1.0008 1.0013 0.9904
dispcorr: -0.026111948 hartree
energy: -1805.243780232854
dipole: -15.08683 13.63345 -1.45337 -31.60933 30.78187 -0.82746 -34.91961 34.30389 -0.61572
magnitude: 1.78216 au
magnitude: 4.52989 debye
