program: Orca
programVersion: 5.0.2
elementType: Cl F O O O O O N C C C C C C C C C C C C C C C C C C C C C H H H H H H H H H H H H H H H H H H H H H H H
charge: 0
multiplicity: 1
keywords: wb97x-d3
keywords: def2-TZVPP
keywords: def2/J RIJCOSX
keywords: DEFGRID2
keywords: scfconv7
keywords: smallprint printgap noloewdin
keywords: NOSOSCF
formula: C21H23ClFNO5
InChI: InChI=1/C21H23ClFNO5/c1-2-3-6-9-28-19(25)12-29-18-11-17(16(23)10-15(18)22)24-20(26)13-7-4-5-8-14(13)21(24)27/h10-11H,2-9,12H2,1H3
52 atoms
Cl 3.856915 1.371377 -2.178553
F  -0.939495 2.719501 -1.496986
O  -2.312165 -1.281188 -2.304189
O  -1.85028 1.57865 1.200329
O  2.855583 -1.192515 -1.436816
O  2.938983 -1.548632 1.163362
O  1.860828 -3.507108 1.065403
N  -1.716622 0.229245 -0.666154
C  -6.02524 -1.347091 0.327249
C  -6.134555 0.055622 0.924885
C  -5.086513 -1.378696 -0.880459
C  -4.786672 0.56256 1.441094
C  -3.860184 -0.604414 -0.568238
C  -3.727386 0.243059 0.453114
C  -2.583823 -0.641888 -1.323177
C  -2.352521 0.799538 0.433873
C  -0.390144 0.485185 -1.046452
C  0.558969 -0.529884 -1.027578
C  -0.017523 1.755373 -1.442591
C  1.872938 -0.275869 -1.396443
C  3.052048 1.09301 2.341828
C  1.286789 2.04463 -1.784958
C  3.473209 -0.192923 3.053966
C  2.222137 1.02857 -1.758959
C  1.550476 1.366137 2.31431
C  2.769143 -1.447951 2.589314
C  0.91631 1.461937 3.69509
C  2.600635 -2.491722 -0.965228
C  2.410773 -2.574559 0.537208
H  -5.653083 -2.038133 1.089651
H  -7.011645 -1.708129 0.033455
H  -6.509358 0.744489 0.162195
H  -6.862621 0.062526 1.736807
H  -4.831442 -2.405695 -1.154904
H  -5.572387 -0.943378 -1.760595
H  -4.819261 1.63846 1.631083
H  -4.537094 0.094969 2.399604
H  0.236129 -1.513687 -0.713079
H  3.431671 1.083953 1.316481
H  3.557707 1.92853 2.835405
H  3.285638 -0.113304 4.128134
H  4.553651 -0.324047 2.94925
H  1.565237 3.048289 -2.078344
H  1.382885 2.302821 1.775859
H  1.039161 0.595904 1.729563
H  3.193891 -2.329458 3.074123
H  1.701244 -1.420259 2.819091
H  -0.138074 1.734288 3.627042
H  0.969056 0.516564 4.238422
H  1.410568 2.219326 4.308111
H  3.482207 -3.082957 -1.222914
H  1.747125 -2.96035 -1.462579
elementType: Cl F O N C H
totalener: -1805.21580647 hartree
nucrepener: 3116.47079842 hartree
electener: -4921.68660489 hartree
oneelecener: -8671.20650012 hartree
twoeener: 3749.51989523 hartree
cpcmener: -0.03640585 hartree
kineticenergy: 1798.94657143 hartree
xcener: -147.727960932962 hartree
chargesum: -0.0000000
charge: -0.074970 -0.209829 -0.400776 -0.414319 -0.304298 -0.258719 -0.449667 -0.034887 -0.134168 -0.135557 -0.078075 -0.073490 -0.084969 -0.034782 0.324712 0.305523 -0.043119 -0.145500 0.194077 0.257951 -0.109423 -0.094604 -0.145971 0.001349 -0.123215 -0.010173 -0.272276 0.018117 0.371703 0.077868 0.080879 0.078672 0.081249 0.093061 0.101121 0.094266 0.102192 0.136218 0.063374 0.081841 0.079066 0.083874 0.132212 0.080458 0.038054 0.122455 0.111288 0.089390 0.077655 0.086311 0.140645 0.127205
qa: -0.0750 -0.2098 -0.4008 -0.4143 -0.3043 -0.2587 -0.4497 -0.0349 -0.1342 -0.1356 -0.0781 -0.0735 -0.0850 -0.0348 0.3247 0.3055 -0.0431 -0.1455 0.1941 0.2580 -0.1094 -0.0946 -0.1460 0.0013 -0.1232 -0.0102 -0.2723 0.0181 0.3717 0.0779 0.0809 0.0787 0.0812 0.0931 0.1011 0.0943 0.1022 0.1362 0.0634 0.0818 0.0791 0.0839 0.1322 0.0805 0.0381 0.1225 0.1113 0.0894 0.0777 0.0863 0.1406 0.1272
va: 1.2308 1.0858 2.1196 2.0985 2.0991 2.1447 2.0611 3.0313 3.9151 3.9149 3.9201 3.9161 3.7097 3.7056 4.1761 4.1634 3.6754 3.8733 4.1205 3.8949 3.8654 3.9586 3.9432 3.8298 3.8909 3.8130 3.9424 3.9123 4.0909 1.0068 1.0095 1.0064 1.0096 1.0159 1.0046 1.0158 1.0047 1.0310 1.0215 1.0097 1.0074 1.0148 1.0153 1.0044 1.0095 1.0041 0.9956 1.0124 0.9987 1.0022 0.9896 1.0029
dispcorr: -0.030868289 hartree
energy: -1805.246674761223
dipole: -17.25478 15.92387 -1.33091 -7.06206 6.69131 -0.37075 34.60653 -33.69853 0.90800
magnitude: 1.65326 au
magnitude: 4.20224 debye
