program: Orca
programVersion: 5.0.2
elementType: Cl F O O O O O N C C C C C C C C C C C C C C C C C C C C C H H H H H H H H H H H H H H H H H H H H H H H
charge: 0
multiplicity: 1
keywords: wb97x-d3
keywords: def2-TZVPP
keywords: def2/J RIJCOSX
keywords: DEFGRID2
keywords: scfconv7
keywords: smallprint printgap noloewdin
keywords: NOSOSCF
formula: C21H23ClFNO5
InChI: InChI=1/C21H23ClFNO5/c1-2-3-6-9-28-19(25)12-29-18-11-17(16(23)10-15(18)22)24-20(26)13-7-4-5-8-14(13)21(24)27/h10-11H,2-9,12H2,1H3
52 atoms
Cl 3.912247 3.012021 1.895351
F  -0.895392 3.637836 0.560029
O  -0.807801 -0.092806 -1.661745
O  -2.640928 1.725025 2.080266
O  3.267908 0.262278 1.555071
O  3.116117 -2.720986 -0.375496
O  3.24169 -0.577915 -1.031359
N  -1.372406 0.947655 0.318501
C  -5.333456 -0.552556 -1.718895
C  -5.765597 -0.622227 -0.25462
C  -3.833399 -0.801031 -1.887716
C  -5.066364 0.435676 0.601752
C  -3.087171 -0.053663 -0.846133
C  -3.628745 0.493997 0.242338
C  -1.630063 0.222747 -0.842374
C  -2.554211 1.147668 1.02957
C  -0.111397 1.430277 0.702692
C  0.93606 0.551226 0.949291
C  0.10345 2.791225 0.823068
C  2.191941 1.027262 1.299659
C  0.632608 -4.099937 -1.382604
C  1.330534 3.290964 1.203986
C  1.5468 -3.187475 -2.193777
C  2.367367 2.407057 1.43505
C  -0.844378 -3.972646 -1.742257
C  2.988037 -3.206834 -1.726764
C  -1.165695 -4.296751 -3.193916
C  3.216469 -1.11768 1.31039
C  3.18766 -1.419598 -0.174337
H  -5.891906 -1.280993 -2.308599
H  -5.581343 0.433032 -2.123433
H  -6.846518 -0.496695 -0.1777
H  -5.537771 -1.615252 0.143123
H  -3.603322 -1.868073 -1.7969
H  -3.497347 -0.505741 -2.884511
H  -5.5154 1.421703 0.443519
H  -5.185459 0.219765 1.666158
H  0.736573 -0.509059 0.867109
H  0.746251 -3.88543 -0.316242
H  0.951948 -5.138878 -1.51979
H  1.166089 -2.161798 -2.189735
H  1.557934 -3.500616 -3.241468
H  1.476918 4.358627 1.300851
H  -1.418669 -4.636835 -1.090554
H  -1.185105 -2.95824 -1.5134
H  3.370659 -4.226896 -1.689141
H  3.632253 -2.632495 -2.393961
H  -2.242779 -4.285413 -3.369379
H  -0.721811 -3.57756 -3.884063
H  -0.80074 -5.288403 -3.471481
H  2.377579 -1.607289 1.816591
H  4.129081 -1.535375 1.740856
elementType: Cl F O N C H
totalener: -1805.21649664 hartree
nucrepener: 3052.99094945 hartree
electener: -4858.20744609 hartree
oneelecener: -8544.67388387 hartree
twoeener: 3686.46643778 hartree
cpcmener: -0.04007261 hartree
kineticenergy: 1798.94853945 hartree
xcener: -147.727460822949 hartree
chargesum: -0.0000000
charge: -0.071746 -0.210370 -0.409700 -0.398573 -0.307239 -0.292147 -0.430935 -0.060245 -0.137748 -0.136080 -0.069772 -0.072776 -0.054623 -0.083472 0.314404 0.330190 -0.004320 -0.163561 0.184783 0.281515 -0.125233 -0.114151 -0.132851 -0.013330 -0.083398 0.004729 -0.281901 0.023117 0.375230 0.080968 0.080288 0.081314 0.078393 0.097940 0.097469 0.101341 0.093343 0.137004 0.073881 0.070254 0.071358 0.088802 0.132996 0.073135 0.020771 0.112808 0.112894 0.090522 0.084003 0.085096 0.131487 0.144134
qa: -0.0717 -0.2104 -0.4097 -0.3986 -0.3072 -0.2921 -0.4309 -0.0602 -0.1377 -0.1361 -0.0698 -0.0728 -0.0546 -0.0835 0.3144 0.3302 -0.0043 -0.1636 0.1848 0.2815 -0.1252 -0.1142 -0.1329 -0.0133 -0.0834 0.0047 -0.2819 0.0231 0.3752 0.0810 0.0803 0.0813 0.0784 0.0979 0.0975 0.1013 0.0933 0.1370 0.0739 0.0703 0.0714 0.0888 0.1330 0.0731 0.0208 0.1128 0.1129 0.0905 0.0840 0.0851 0.1315 0.1441
va: 1.2401 1.0839 2.0971 2.1241 2.1053 2.1297 2.0666 3.0592 3.9238 3.9173 3.9167 3.9183 3.6993 3.7044 4.1544 4.1910 3.6870 3.9451 4.1223 3.8828 3.8667 3.9830 3.8483 3.8975 3.8942 3.8660 3.9249 3.8869 4.1271 1.0093 1.0066 1.0092 1.0066 1.0063 1.0150 1.0037 1.0157 1.0197 1.0206 1.0093 1.0290 1.0131 1.0151 1.0079 1.0281 0.9976 1.0138 1.0057 0.9966 1.0016 0.9973 0.9967
dispcorr: -0.028423972 hartree
energy: -1805.244920612843
dipole: -30.44146 28.61719 -1.82427 -50.20804 47.34132 -2.86672 -26.92133 26.52764 -0.39370
magnitude: 3.42068 au
magnitude: 8.69468 debye
