program: Orca
programVersion: 5.0.2
elementType: Cl F O O O O O N C C C C C C C C C C C C C C C C C C C C C H H H H H H H H H H H H H H H H H H H H H H H
charge: 0
multiplicity: 1
keywords: wb97x-d3
keywords: def2-TZVPP
keywords: def2/J RIJCOSX
keywords: DEFGRID2
keywords: scfconv7
keywords: smallprint printgap noloewdin
keywords: NOSOSCF
formula: C21H23ClFNO5
InChI: InChI=1/C21H23ClFNO5/c1-2-3-6-9-28-19(25)12-29-18-11-17(16(23)10-15(18)22)24-20(26)13-7-4-5-8-14(13)21(24)27/h10-11H,2-9,12H2,1H3
52 atoms
Cl 3.879364 1.350241 -2.181191
F  -0.922268 2.712235 -1.573257
O  -2.265351 -1.371534 -2.241215
O  -1.869746 1.673278 1.113105
O  2.869153 -1.19935 -1.400963
O  2.915531 -1.522786 1.200552
O  1.873178 -3.501379 1.116164
N  -1.705421 0.238587 -0.686747
C  -6.239906 -0.828842 -0.088436
C  -5.87334 -0.466798 1.350668
C  -5.050762 -1.424246 -0.844292
C  -4.783447 0.604941 1.404485
C  -3.834265 -0.627322 -0.553305
C  -3.719791 0.270672 0.426114
C  -2.552666 -0.684755 -1.297315
C  -2.355679 0.85119 0.38196
C  -0.377628 0.487774 -1.065987
C  0.571427 -0.526385 -1.018848
C  -0.001475 1.749139 -1.48689
C  1.887648 -0.280942 -1.384607
C  2.985655 1.128888 2.347486
C  1.306154 2.031153 -1.822398
C  3.424724 -0.140587 3.077762
C  2.240749 1.015919 -1.768718
C  1.480035 1.376081 2.31083
C  2.743773 -1.412919 2.62525
C  0.840725 1.486955 3.688041
C  2.605976 -2.49315 -0.919803
C  2.409618 -2.563959 0.58227
H  -7.070903 -1.535017 -0.099921
H  -6.583735 0.068926 -0.610476
H  -6.756043 -0.119566 1.88952
H  -5.520616 -1.362736 1.870527
H  -4.880988 -2.463954 -0.544889
H  -5.241629 -1.448861 -1.919968
H  -5.196301 1.590405 1.165761
H  -4.3647 0.689795 2.409835
H  0.247748 -1.503124 -0.684512
H  3.369675 1.112914 1.323818
H  3.47494 1.979046 2.832383
H  3.230974 -0.050706 4.149981
H  4.507643 -0.254793 2.979035
H  1.587119 3.028599 -2.133694
H  1.298004 2.299158 1.754144
H  0.983491 0.586266 1.739664
H  3.18566 -2.282073 3.117532
H  1.675559 -1.403488 2.855872
H  0.907751 0.552668 4.248605
H  1.321461 2.263287 4.287928
H  -0.217776 1.740662 3.612476
H  3.486083 -3.090331 -1.16786
H  1.753346 -2.963055 -1.417667
elementType: Cl F O N C H
totalener: -1805.21571412 hartree
nucrepener: 3118.32387009 hartree
electener: -4923.53958420 hartree
oneelecener: -8674.87834118 hartree
twoeener: 3751.33875698 hartree
cpcmener: -0.03643213 hartree
kineticenergy: 1798.95561196 hartree
xcener: -147.729955733454 hartree
chargesum: -0.0000000
charge: -0.075456 -0.209635 -0.400641 -0.412805 -0.304476 -0.258043 -0.450792 -0.030446 -0.135831 -0.136545 -0.075841 -0.072284 -0.086961 -0.034939 0.323593 0.303013 -0.041709 -0.150315 0.191962 0.258604 -0.106507 -0.090603 -0.146520 -0.001379 -0.126959 -0.010800 -0.271953 0.016791 0.373141 0.081264 0.078063 0.081740 0.078719 0.101019 0.094740 0.100939 0.093719 0.137237 0.063371 0.081695 0.079001 0.083991 0.132183 0.079164 0.041834 0.122502 0.111422 0.077978 0.086076 0.089241 0.140694 0.127745
qa: -0.0755 -0.2096 -0.4006 -0.4128 -0.3045 -0.2580 -0.4508 -0.0304 -0.1358 -0.1365 -0.0758 -0.0723 -0.0870 -0.0349 0.3236 0.3030 -0.0417 -0.1503 0.1920 0.2586 -0.1065 -0.0906 -0.1465 -0.0014 -0.1270 -0.0108 -0.2720 0.0168 0.3731 0.0813 0.0781 0.0817 0.0787 0.1010 0.0947 0.1009 0.0937 0.1372 0.0634 0.0817 0.0790 0.0840 0.1322 0.0792 0.0418 0.1225 0.1114 0.0780 0.0861 0.0892 0.1407 0.1277
va: 1.2303 1.0861 2.1195 2.0999 2.0992 2.1449 2.0604 3.0377 3.9139 3.9139 3.9185 3.9157 3.7122 3.7067 4.1789 4.1686 3.6831 3.8695 4.1154 3.8959 3.8643 3.9563 3.9437 3.8303 3.8930 3.8132 3.9427 3.9144 4.0901 1.0093 1.0069 1.0094 1.0069 1.0048 1.0151 1.0050 1.0156 1.0306 1.0211 1.0097 1.0075 1.0146 1.0151 1.0054 1.0071 1.0040 0.9955 0.9987 1.0021 1.0120 0.9898 1.0028
dispcorr: -0.030911387 hartree
energy: -1805.246625503194
dipole: -17.73666 16.38161 -1.35505 -6.82067 6.45856 -0.36210 34.85354 -33.92729 0.92625
magnitude: 1.68084 au
magnitude: 4.27235 debye
