program: Orca
programVersion: 5.0.2
elementType: Cl F O O O O O N C C C C C C C C C C C C C C C C C C C C C H H H H H H H H H H H H H H H H H H H H H H H
charge: 0
multiplicity: 1
keywords: wb97x-d3
keywords: def2-TZVPP
keywords: def2/J RIJCOSX
keywords: DEFGRID2
keywords: scfconv7
keywords: smallprint printgap noloewdin
keywords: NOSOSCF
formula: C21H23ClFNO5
InChI: InChI=1/C21H23ClFNO5/c1-2-3-6-9-28-19(25)12-29-18-11-17(16(23)10-15(18)22)24-20(26)13-7-4-5-8-14(13)21(24)27/h10-11H,2-9,12H2,1H3
52 atoms
Cl 3.765588 1.619949 2.704885
F  -1.189346 0.815675 3.018838
O  -2.632515 2.705538 1.223272
O  -1.211452 -1.059492 -0.890491
O  3.221173 1.576079 -0.091081
O  3.259993 -0.892105 -0.979833
O  2.929937 -0.29253 -3.116362
N  -1.563434 0.874827 0.313591
C  -6.016938 0.850254 -1.204181
C  -5.727499 -0.650179 -1.213446
C  -5.206695 1.587249 -0.135401
C  -4.259996 -0.946761 -1.527017
C  -3.815295 1.074874 -0.123479
C  -3.397427 -0.029631 -0.743151
C  -2.661033 1.695431 0.57207
C  -1.945174 -0.192711 -0.494354
C  -0.285907 1.048652 0.866848
C  0.826546 1.227065 0.05323
C  -0.12509 1.029457 2.240165
C  2.088339 1.388918 0.6085
C  1.828237 -4.343836 -1.606584
C  1.11136 1.218804 2.819867
C  1.81203 -2.835418 -1.379046
C  2.210588 1.394656 2.001084
C  0.443734 -4.951386 -1.810989
C  3.225867 -2.298132 -1.290642
C  -0.485407 -4.801861 -0.615227
C  3.212873 1.413668 -1.485411
C  3.099348 -0.023588 -1.953957
H  -5.781244 1.268731 -2.186771
H  -7.080932 1.024671 -1.038283
H  -5.977681 -1.074834 -0.236842
H  -6.3654 -1.14992 -1.943857
H  -5.213791 2.66529 -0.313937
H  -5.649267 1.445117 0.856023
H  -4.013335 -1.986518 -1.298997
H  -4.055072 -0.815739 -2.594498
H  0.674402 1.248579 -1.017631
H  2.317645 -4.835849 -0.759165
H  2.442929 -4.567368 -2.484209
H  1.282314 -2.594839 -0.454267
H  1.272432 -2.349973 -2.196613
H  1.214604 1.211728 3.896855
H  -0.021701 -4.502546 -2.694045
H  0.562208 -6.013862 -2.0401
H  3.763131 -2.768506 -0.467335
H  3.786017 -2.488778 -2.208244
H  -0.029452 -5.199097 0.294595
H  -0.747222 -3.760878 -0.424399
H  -1.41992 -5.342238 -0.776149
H  4.176095 1.791636 -1.835986
H  2.444641 2.014404 -1.980962
elementType: Cl F O N C H
totalener: -1805.21587237 hartree
nucrepener: 3044.75248079 hartree
electener: -4849.96835316 hartree
oneelecener: -8528.05868334 hartree
twoeener: 3678.09033018 hartree
cpcmener: -0.03596159 hartree
kineticenergy: 1798.95428759 hartree
xcener: -147.727571540589 hartree
chargesum: 0.0000000
charge: -0.070341 -0.210673 -0.397385 -0.419152 -0.308959 -0.265340 -0.456342 -0.055974 -0.137238 -0.135371 -0.072143 -0.075784 -0.079024 -0.051988 0.327407 0.324538 0.004183 -0.174199 0.185366 0.277976 -0.129398 -0.113493 -0.117696 -0.004035 -0.097435 0.004073 -0.272949 0.010201 0.390709 0.078606 0.080843 0.079039 0.081217 0.095091 0.101399 0.093129 0.101151 0.137870 0.069340 0.075670 0.063268 0.078185 0.133901 0.056455 0.069363 0.114383 0.102337 0.080950 0.070144 0.090903 0.141763 0.125457
qa: -0.0703 -0.2107 -0.3974 -0.4192 -0.3090 -0.2653 -0.4563 -0.0560 -0.1372 -0.1354 -0.0721 -0.0758 -0.0790 -0.0520 0.3274 0.3245 0.0042 -0.1742 0.1854 0.2780 -0.1294 -0.1135 -0.1177 -0.0040 -0.0974 0.0041 -0.2729 0.0102 0.3907 0.0786 0.0808 0.0790 0.0812 0.0951 0.1014 0.0931 0.1012 0.1379 0.0693 0.0757 0.0633 0.0782 0.1339 0.0565 0.0694 0.1144 0.1023 0.0809 0.0701 0.0909 0.1418 0.1255
va: 1.2412 1.0837 2.1251 2.0992 2.1005 2.1550 2.0529 3.0546 3.9161 3.9134 3.9162 3.9186 3.6977 3.7040 4.1904 4.1523 3.6596 3.9025 4.1230 3.8726 3.9095 3.9866 3.8364 3.9056 3.8868 3.8525 3.9283 3.9304 4.0913 1.0064 1.0094 1.0067 1.0095 1.0148 1.0047 1.0153 1.0048 1.0251 1.0089 1.0116 1.0169 1.0233 1.0148 1.0098 1.0074 1.0004 1.0142 1.0023 1.0058 1.0051 0.9911 1.0014
dispcorr: -0.027462493 hartree
energy: -1805.243334862690
dipole: -24.29416 22.72552 -1.56864 -37.16835 36.39956 -0.76878 -28.66975 27.89087 -0.77888
magnitude: 1.91267 au
magnitude: 4.86162 debye
