program: Orca
programVersion: 5.0.2
elementType: Cl F O O O O O N C C C C C C C C C C C C C C C C C C C C C H H H H H H H H H H H H H H H H H H H H H H H
charge: 0
multiplicity: 1
keywords: wb97x-d3
keywords: def2-TZVPP
keywords: def2/J RIJCOSX
keywords: DEFGRID2
keywords: scfconv7
keywords: smallprint printgap noloewdin
keywords: NOSOSCF
formula: C21H23ClFNO5
InChI: InChI=1/C21H23ClFNO5/c1-2-3-6-9-28-19(25)12-29-18-11-17(16(23)10-15(18)22)24-20(26)13-7-4-5-8-14(13)21(24)27/h10-11H,2-9,12H2,1H3
52 atoms
Cl 4.140358 3.072489 1.23881
F  -0.863589 3.521279 1.024041
O  -0.87469 0.632708 -2.418079
O  -2.227702 1.097329 1.90042
O  3.603441 0.603452 -0.102652
O  2.699401 -2.714228 -0.944505
O  3.135184 -1.831973 1.074179
N  -1.211252 1.051778 -0.171525
C  -4.958019 -1.268044 -1.796637
C  -5.636654 -0.433097 -0.711486
C  -3.752333 -0.547324 -2.401886
C  -4.697398 -0.147851 0.461443
C  -2.954341 0.072979 -1.316577
C  -3.3636 0.238343 -0.058378
C  -1.573435 0.595969 -1.440078
C  -2.259374 0.844249 0.725949
C  0.059913 1.53593 0.169427
C  1.190547 0.778895 -0.115977
C  0.211751 2.768904 0.77685
C  2.459437 1.250193 0.184396
C  -0.19403 -3.319886 -0.646324
C  1.459291 3.242566 1.128379
C  0.892791 -3.905816 0.247661
C  2.575586 2.486103 0.825959
C  -1.589949 -3.402318 -0.035547
C  2.264111 -3.97397 -0.396936
C  -1.713563 -2.692908 1.305938
C  3.542585 -0.542352 -0.912092
C  3.094672 -1.759294 -0.125583
H  -4.630052 -2.219975 -1.368003
H  -5.672173 -1.510567 -2.584781
H  -5.972415 0.514821 -1.14215
H  -6.529179 -0.944666 -0.34871
H  -3.13381 -1.236567 -2.982381
H  -4.074835 0.229412 -3.103299
H  -5.099116 0.640157 1.103171
H  -4.591445 -1.031636 1.099586
H  1.046104 -0.186412 -0.580535
H  -0.192768 -3.838126 -1.610642
H  0.026351 -2.269935 -0.864503
H  0.633316 -4.936514 0.512293
H  0.949887 -3.35889 1.190401
H  1.555777 4.205233 1.612846
H  -2.30216 -2.966539 -0.742551
H  -1.88257 -4.450856 0.077707
H  3.010846 -4.348224 0.306526
H  2.25104 -4.642656 -1.2573
H  -1.186246 -3.222804 2.100313
H  -1.295525 -1.685539 1.262718
H  -2.755964 -2.606293 1.616835
H  4.562059 -0.724454 -1.261828
H  2.92025 -0.391675 -1.799031
elementType: Cl F O N C H
totalener: -1805.21446513 hartree
nucrepener: 3128.89544469 hartree
electener: -4934.10990982 hartree
oneelecener: -8695.64160919 hartree
twoeener: 3761.53169937 hartree
cpcmener: -0.03972205 hartree
kineticenergy: 1798.94664457 hartree
xcener: -147.728954690539 hartree
chargesum: 0.0000000
charge: -0.071032 -0.207873 -0.398578 -0.392494 -0.303766 -0.285859 -0.433547 -0.019360 -0.149269 -0.130215 -0.077204 -0.068247 -0.071878 -0.063295 0.293405 0.262755 0.005688 -0.163412 0.190415 0.271596 -0.117967 -0.111692 -0.132379 -0.017220 -0.099777 -0.010910 -0.307116 0.028145 0.367410 0.081891 0.085682 0.079019 0.081460 0.097886 0.109299 0.099036 0.102605 0.127468 0.078871 0.049157 0.085569 0.083540 0.133006 0.053979 0.074303 0.119113 0.113958 0.106133 0.077922 0.100967 0.140821 0.131994
qa: -0.0710 -0.2079 -0.3986 -0.3925 -0.3038 -0.2859 -0.4335 -0.0194 -0.1493 -0.1302 -0.0772 -0.0682 -0.0719 -0.0633 0.2934 0.2628 0.0057 -0.1634 0.1904 0.2716 -0.1180 -0.1117 -0.1324 -0.0172 -0.0998 -0.0109 -0.3071 0.0281 0.3674 0.0819 0.0857 0.0790 0.0815 0.0979 0.1093 0.0990 0.1026 0.1275 0.0789 0.0492 0.0856 0.0835 0.1330 0.0540 0.0743 0.1191 0.1140 0.1061 0.0779 0.1010 0.1408 0.1320
va: 1.2394 1.0873 2.1142 2.1174 2.1145 2.1222 2.0697 3.0344 3.9163 3.9064 3.8980 3.9049 3.6294 3.6186 4.1559 4.1707 3.6906 3.9382 4.1099 3.9668 3.8790 3.9769 3.8113 3.8913 3.8722 3.8812 3.9380 3.9003 4.1010 1.0046 1.0108 1.0071 1.0100 1.0137 1.0047 1.0166 1.0085 1.0236 1.0156 1.0232 1.0135 1.0251 1.0146 1.0155 1.0111 1.0060 0.9977 0.9993 0.9984 1.0051 0.9906 1.0047
dispcorr: -0.032362814 hartree
energy: -1805.246827946590
dipole: -35.15492 33.24431 -1.91061 -46.57657 44.29099 -2.28558 -10.59726 8.60770 -1.98956
magnitude: 3.58227 au
magnitude: 9.10540 debye
